[Bug 1267337] Re: ndiswrapper 1.58-2 fails to build on kernel 3.13.x [error: implicit declaration of function ‘INIT_COMPLETION’]
Wyatt Ward
legend5459 at gmail.com
Tue Feb 4 22:54:21 UTC 2014
Still an issue for those with custom kernels.
--
You received this bug notification because you are a member of Ubuntu
Foundations Bugs, which is subscribed to ndiswrapper in Ubuntu.
https://bugs.launchpad.net/bugs/1267337
Title:
ndiswrapper 1.58-2 fails to build on kernel 3.13.x [error: implicit
declaration of function ‘INIT_COMPLETION’]
Status in “ndiswrapper” package in Ubuntu:
Incomplete
Bug description:
Examining /etc/kernel/postinst.d.
run-parts: executing /etc/kernel/postinst.d/apt-auto-removal 3.13.0-1-generic /boot/vmlinuz-3.13.0-1-generic
run-parts: executing /etc/kernel/postinst.d/dkms 3.13.0-1-generic /boot/vmlinuz-3.13.0-1-generic
Error! Bad return status for module build on kernel: 3.13.0-1-generic (i686)
Consult /var/lib/dkms/ndiswrapper/1.58/build/make.log for more information.
run-parts: executing /etc/kernel/postinst.d/initramfs-tools 3.13.0-1-generic /boot/vmlinuz-3.13.0-1-generic
which in turn results in
DKMS make.log for ndiswrapper-1.58 for kernel 3.13.0-1-generic (i686)
Wed Jan 8 18:24:53 EST 2014
make: Entering directory `/usr/src/linux-headers-3.13.0-1-generic'
LD /var/lib/dkms/ndiswrapper/1.58/build/built-in.o
MKEXPORT /var/lib/dkms/ndiswrapper/1.58/build/crt_exports.h
MKEXPORT /var/lib/dkms/ndiswrapper/1.58/build/hal_exports.h
MKEXPORT /var/lib/dkms/ndiswrapper/1.58/build/ndis_exports.h
MKEXPORT /var/lib/dkms/ndiswrapper/1.58/build/ntoskernel_exports.h
MKEXPORT /var/lib/dkms/ndiswrapper/1.58/build/ntoskernel_io_exports.h
MKEXPORT /var/lib/dkms/ndiswrapper/1.58/build/rtl_exports.h
MKEXPORT /var/lib/dkms/ndiswrapper/1.58/build/usb_exports.h
CC [M] /var/lib/dkms/ndiswrapper/1.58/build/crt.o
CC [M] /var/lib/dkms/ndiswrapper/1.58/build/hal.o
CC [M] /var/lib/dkms/ndiswrapper/1.58/build/iw_ndis.o
CC [M] /var/lib/dkms/ndiswrapper/1.58/build/loader.o
/var/lib/dkms/ndiswrapper/1.58/build/loader.c: In function ‘load_wrap_driver’:
/var/lib/dkms/ndiswrapper/1.58/build/loader.c:96:3: error: implicit declaration of function ‘INIT_COMPLETION’ [-Werror=implicit-function-declaration]
INIT_COMPLETION(loader_complete);
^
cc1: some warnings being treated as errors
make[1]: *** [/var/lib/dkms/ndiswrapper/1.58/build/loader.o] Error 1
make: *** [_module_/var/lib/dkms/ndiswrapper/1.58/build] Error 2
make: Leaving directory `/usr/src/linux-headers-3.13.0-1-generic'
ProblemType: Bug
DistroRelease: Ubuntu 14.04
Package: ndiswrapper-dkms 1.58-2
ProcVersionSignature: Ubuntu 3.11.0-13.20-generic 3.11.6
Uname: Linux 3.11.0-13-generic i686
ApportVersion: 2.12.7-0ubuntu6
Architecture: i386
CurrentDesktop: GNOME
Date: Thu Jan 9 01:10:17 2014
InstallationDate: Installed on 2013-06-24 (198 days ago)
InstallationMedia: Edubuntu 12.04.2 LTS "Precise Pangolin" - Release i386 (20130214)
PackageArchitecture: all
SourcePackage: ndiswrapper
UpgradeStatus: Upgraded to trusty on 2013-11-26 (43 days ago)
To manage notifications about this bug go to:
https://bugs.launchpad.net/ubuntu/+source/ndiswrapper/+bug/1267337/+subscriptions
More information about the foundations-bugs
mailing list