[Bug 1313133] [NEW] sa-compile error on ubuntu 14.04 LTS upgrade

n00buntu shamil at gmail.com
Sat Apr 26 15:48:07 UTC 2014


Public bug reported:

I upgraded to 14.04 from 12.??  and I got this error:

Setting up sa-compile (3.4.0-1ubuntu1) ...
Running sa-compile (may take a long time)
Can't exec "rm": No such file or directory at /usr/bin/sa-compile line 374, <$fh> line 1.
make: chmod: Command not found
make: *** [blib/lib/Mail/SpamAssassin/CompiledRegexps/.exists] Error 127
command 'make >>/tmp/.spamassassin21149bfnDUGtmp/log' failed: exit 2
dpkg: error processing package sa-compile (--configure):
 subprocess installed post-installation script returned error exit status 25
Errors were encountered while processing:
 sa-compile
E: Sub-process /usr/bin/dpkg returned an error code (1)

** Affects: gcc-4.8 (Ubuntu)
     Importance: Undecided
         Status: New

-- 
You received this bug notification because you are a member of Ubuntu
Foundations Bugs, which is subscribed to gcc-4.8 in Ubuntu.
https://bugs.launchpad.net/bugs/1313133

Title:
  sa-compile error on ubuntu 14.04 LTS upgrade

Status in “gcc-4.8” package in Ubuntu:
  New

Bug description:
  I upgraded to 14.04 from 12.??  and I got this error:

  Setting up sa-compile (3.4.0-1ubuntu1) ...
  Running sa-compile (may take a long time)
  Can't exec "rm": No such file or directory at /usr/bin/sa-compile line 374, <$fh> line 1.
  make: chmod: Command not found
  make: *** [blib/lib/Mail/SpamAssassin/CompiledRegexps/.exists] Error 127
  command 'make >>/tmp/.spamassassin21149bfnDUGtmp/log' failed: exit 2
  dpkg: error processing package sa-compile (--configure):
   subprocess installed post-installation script returned error exit status 25
  Errors were encountered while processing:
   sa-compile
  E: Sub-process /usr/bin/dpkg returned an error code (1)

To manage notifications about this bug go to:
https://bugs.launchpad.net/ubuntu/+source/gcc-4.8/+bug/1313133/+subscriptions



More information about the foundations-bugs mailing list