[Bug 1311543] Re: package grub-pc 2.02~beta2-9 failed to install/upgrade: ErrorMessage: subprocess installed post-installation script returned error exit status 1
Rui Andrada
shingonoide at gmail.com
Wed Apr 23 09:02:13 UTC 2014
Trying to execute "dpkg --configure -a" return this.
# dpkg --configure -a
Setting up grub-pc (2.02~beta2-9) ...
locale: Cannot set LC_CTYPE to default locale: No such file or directory
locale: Cannot set LC_MESSAGES to default locale: No such file or directory
locale: Cannot set LC_ALL to default locale: No such file or directory
/usr/sbin/grub-probe: error: failed to get canonical path of `none'.
dpkg: error processing package grub-pc (--configure):
subprocess installed post-installation script returned error exit status 1
Errors were encountered while processing:
grub-pc
--
You received this bug notification because you are a member of Ubuntu
Foundations Bugs, which is subscribed to grub2 in Ubuntu.
https://bugs.launchpad.net/bugs/1311543
Title:
package grub-pc 2.02~beta2-9 failed to install/upgrade: ErrorMessage:
subprocess installed post-installation script returned error exit
status 1
Status in “grub2” package in Ubuntu:
New
Bug description:
In the end of installation grub can't install the package and into boot sector.
Grub shows me this message:
grub-install: error: failed to get canonical path of `none'
I'll trying to fix my installation alone before reboot, but I think
it's good try to report this bug before.
lsb_release -rd
Description: Ubuntu 14.04 LTS
Release: 14.04
# lsb_release -rd
Description: Ubuntu 14.04 LTS
Release: 14.04
# apt-cache policy grub
grub:
Installed: (none)
Candidate: 0.97-29ubuntu66
Version table:
0.97-29ubuntu66 0
500 http://br.archive.ubuntu.com/ubuntu/ trusty/main amd64 Packages
# apt-cache policy grub-pc
grub-pc:
Installed: 2.02~beta2-9
Candidate: 2.02~beta2-9
Version table:
*** 2.02~beta2-9 0
500 http://br.archive.ubuntu.com/ubuntu/ trusty/main amd64 Packages
100 /var/lib/dpkg/status
ProblemType: Package
DistroRelease: Ubuntu 14.04
Package: grub-pc 2.02~beta2-9
ProcVersionSignature: Ubuntu 3.2.0-60.91-generic 3.2.55
Uname: Linux 3.2.0-60-generic x86_64
ApportVersion: 2.14.1-0ubuntu3
Architecture: amd64
Date: Wed Apr 23 05:49:44 2014
DuplicateSignature: package:grub-pc:2.02~beta2-9:ErrorMessage: subprocess installed post-installation script returned error exit status 1
ErrorMessage: ErrorMessage: subprocess installed post-installation script returned error exit status 1
InstallationDate: Installed on 2011-12-03 (872 days ago)
InstallationMedia: Ubuntu-Server 11.10 "Oneiric Ocelot" - Release amd64 (20111011)
SourcePackage: grub2
Title: package grub-pc 2.02~beta2-9 failed to install/upgrade: ErrorMessage: subprocess installed post-installation script returned error exit status 1
UpgradeStatus: Upgraded to trusty on 2014-04-23 (0 days ago)
To manage notifications about this bug go to:
https://bugs.launchpad.net/ubuntu/+source/grub2/+bug/1311543/+subscriptions
More information about the foundations-bugs
mailing list