[Bug 1308573] [NEW] package python-imaging-compat 1.1.7+2.0.0-1ubuntu1 failed to install/upgrade: error al escribir en `<salida estándar>': Error de entrada/salida

jose ricardo hernandez lara 1308573 at bugs.launchpad.net
Wed Apr 16 14:02:22 UTC 2014


Public bug reported:

I don't know

ProblemType: Package
DistroRelease: Ubuntu 13.10
Package: python-imaging-compat 1.1.7+2.0.0-1ubuntu1
ProcVersionSignature: Ubuntu 3.11.0-19.33-generic 3.11.10.5
Uname: Linux 3.11.0-19-generic i686
ApportVersion: 2.12.5-0ubuntu2.2
Architecture: i386
Date: Mon Apr 14 22:10:07 2014
DuplicateSignature: package:python-imaging-compat:1.1.7+2.0.0-1ubuntu1:error al escribir en `<salida estándar>': Error de entrada/salida
ErrorMessage: error al escribir en `<salida estándar>': Error de entrada/salida
InstallationDate: Installed on 2014-04-14 (1 days ago)
InstallationMedia: Lubuntu 13.10 "Saucy Salamander" - Release i386 (20131016.1)
MarkForUpload: True
PackageArchitecture: all
SourcePackage: python-imaging
Title: package python-imaging-compat 1.1.7+2.0.0-1ubuntu1 failed to install/upgrade: error al escribir en `<salida estándar>': Error de entrada/salida
UpgradeStatus: No upgrade log present (probably fresh install)

** Affects: python-imaging (Ubuntu)
     Importance: Undecided
         Status: New


** Tags: apport-package i386 need-duplicate-check saucy

-- 
You received this bug notification because you are a member of Ubuntu
Foundations Bugs, which is subscribed to python-imaging in Ubuntu.
https://bugs.launchpad.net/bugs/1308573

Title:
  package python-imaging-compat 1.1.7+2.0.0-1ubuntu1 failed to
  install/upgrade: error al escribir en `<salida estándar>': Error de
  entrada/salida

Status in “python-imaging” package in Ubuntu:
  New

Bug description:
  I don't know

  ProblemType: Package
  DistroRelease: Ubuntu 13.10
  Package: python-imaging-compat 1.1.7+2.0.0-1ubuntu1
  ProcVersionSignature: Ubuntu 3.11.0-19.33-generic 3.11.10.5
  Uname: Linux 3.11.0-19-generic i686
  ApportVersion: 2.12.5-0ubuntu2.2
  Architecture: i386
  Date: Mon Apr 14 22:10:07 2014
  DuplicateSignature: package:python-imaging-compat:1.1.7+2.0.0-1ubuntu1:error al escribir en `<salida estándar>': Error de entrada/salida
  ErrorMessage: error al escribir en `<salida estándar>': Error de entrada/salida
  InstallationDate: Installed on 2014-04-14 (1 days ago)
  InstallationMedia: Lubuntu 13.10 "Saucy Salamander" - Release i386 (20131016.1)
  MarkForUpload: True
  PackageArchitecture: all
  SourcePackage: python-imaging
  Title: package python-imaging-compat 1.1.7+2.0.0-1ubuntu1 failed to install/upgrade: error al escribir en `<salida estándar>': Error de entrada/salida
  UpgradeStatus: No upgrade log present (probably fresh install)

To manage notifications about this bug go to:
https://bugs.launchpad.net/ubuntu/+source/python-imaging/+bug/1308573/+subscriptions



More information about the foundations-bugs mailing list