[Bug 1270599] Re: undefined reference to symbol 'archive_entry_size'

James Michael DuPont JamesMikeDuPont at gmail.com
Tue Apr 1 21:35:44 UTC 2014


I have a solution for this, 
first I built the lib archive
 git at github.com:sonar-gnu-linux/libarchive.git 

and then I build the pacman, with one patch to the makefile,
https://github.com/h4ck3rm1k3/pacman/commit/ae6ba2481ce5ad7b38955c04a607c04aa5554ca4

Did not test again with the standard libarchive....

mike

-- 
You received this bug notification because you are a member of Ubuntu
Foundations Bugs, which is subscribed to libarchive in Ubuntu.
https://bugs.launchpad.net/bugs/1270599

Title:
  undefined reference to symbol 'archive_entry_size'

Status in “libarchive” package in Ubuntu:
  New

Bug description:
  Trying to build pacman, the archlinux package manager, to make chroots on Ubuntu.
  However, I get this when building it:

  /usr/bin/ld: check.o: undefined reference to symbol 'archive_entry_size'
  /usr/lib/x86_64-linux-gnu/libarchive.so.13: error adding symbols: DSO missing from command line
  collect2: error: ld returned 1 exit status

  Before asking the ArchLinux developers, I'd like to make sure our
  dependencies are good.

  Source code:
  https://code.launchpad.net/~thopiekar/pacman-pm/pacman
  Packaging files (currently simple):
  https://code.launchpad.net/~thopiekar/+junk/pacman-pm-packaging

  Trusty builds:
  https://launchpadlibrarian.net/162874378/buildlog_ubuntu-saucy-i386.pacman-pm_0.0.1%2B201401191536~4454~4~ubuntu13.10.1_FAILEDTOBUILD.txt.gz
  https://launchpadlibrarian.net/162874648/buildlog_ubuntu-saucy-amd64.pacman-pm_0.0.1%2B201401191536~4454~4~ubuntu13.10.1_FAILEDTOBUILD.txt.gz

  Saucy builds:
  https://launchpadlibrarian.net/162875078/buildlog_ubuntu-saucy-i386.pacman-pm_0.0.1%2B201401191551~4454~4~ubuntu13.10.1_FAILEDTOBUILD.txt.gz
  https://code.launchpad.net/~thopiekar/+archive/pacman/+build/5478577/+files/buildlog_ubuntu-saucy-amd64.pacman-pm_0.0.1%2B201401191551~4454~4~ubuntu13.10.1_FAILEDTOBUILD.txt.gz

To manage notifications about this bug go to:
https://bugs.launchpad.net/ubuntu/+source/libarchive/+bug/1270599/+subscriptions



More information about the foundations-bugs mailing list