[Bug 1243755] Re: git test failures on every architecture except amd64

Anders Kaseorg andersk at mit.edu
Wed Oct 30 08:00:27 UTC 2013


Yep.  I did some digging and found that the failing test passes when run
with PERL_HASH_SEED=0 in the environment.

-- 
You received this bug notification because you are a member of Ubuntu
Foundations Bugs, which is subscribed to git in Ubuntu.
https://bugs.launchpad.net/bugs/1243755

Title:
  git test failures on every architecture except amd64

Status in “git” package in Ubuntu:
  Confirmed
Status in “git” source package in Trusty:
  Confirmed
Status in “git” package in Debian:
  New

Bug description:
  in trusty:

  Annotations for merge
  ***************
  ok 41 - cvs annotate

  # still have 1 known breakage(s)
  # failed 1 among remaining 40 test(s)
  1..41
  make[3]: *** [t9400-git-cvsserver-server.sh] Error 1
  make[3]: Leaving directory `/build/buildd/git-1.8.4.1/t'
  make[2]: *** [test] Error 2
  make[2]: Leaving directory `/build/buildd/git-1.8.4.1/t'
  make[1]: *** [test] Error 2
  make[1]: Leaving directory `/build/buildd/git-1.8.4.1'
  make: *** [build-arch-stamp] Error 2

To manage notifications about this bug go to:
https://bugs.launchpad.net/ubuntu/+source/git/+bug/1243755/+subscriptions



More information about the foundations-bugs mailing list