[Bug 1024204] Re: package python3 3.2.3-3 failed to install/upgrade: subprocess installed post-installation script returned error exit status 4
asala
1024204 at bugs.launchpad.net
Thu Oct 24 12:30:29 UTC 2013
Seems that the 13.04 to 13.10 upgrade script didn't update ubiquity-frontend-gtk. I changed Bug #1244198 which I reported as a python bug to be an ubiquity bug. However, I'm not a developer so I don't really know what I am doing but
sudo apt-get install ubiquity-frontend-gtk
seemed to solve everything.
--
You received this bug notification because you are a member of Ubuntu
Foundations Bugs, which is subscribed to python3-defaults in Ubuntu.
https://bugs.launchpad.net/bugs/1024204
Title:
package python3 3.2.3-3 failed to install/upgrade: subprocess
installed post-installation script returned error exit status 4
Status in “python3-defaults” package in Ubuntu:
Fix Released
Bug description:
Setting up python3 (3.2.3-3) ...
running python rtupdate hooks for python3.2...
Traceback (most recent call last):
File "/usr/bin/py3clean", line 182, in <module>
main()
File "/usr/bin/py3clean", line 174, in main
files = files & pfiles
TypeError: unsupported operand type(s) for &: 'generator' and 'generator'
error running python rtupdate hook screen-resolution-extra
Traceback (most recent call last):
File "/usr/bin/py3clean", line 182, in <module>
main()
File "/usr/bin/py3clean", line 174, in main
files = files & pfiles
TypeError: unsupported operand type(s) for &: 'generator' and 'generator'
error running python rtupdate hook ubuntu-drivers-common
dpkg: error processing python3 (--configure):
subprocess installed post-installation script returned error exit status 4
ProblemType: Package
DistroRelease: Ubuntu 12.10
Package: python3 3.2.3-3
ProcVersionSignature: Ubuntu 3.5.0-4.4-generic 3.5.0-rc6
Uname: Linux 3.5.0-4-generic x86_64
NonfreeKernelModules: openafs
ApportVersion: 2.3-0ubuntu4
Architecture: amd64
Date: Fri Jul 13 01:02:18 2012
ErrorMessage: subprocess installed post-installation script returned error exit status 4
InstallationMedia: Ubuntu 11.04 "Natty Narwhal" - Alpha amd64 (20101202)
PackageArchitecture: all
SourcePackage: python3-defaults
Title: package python3 3.2.3-3 failed to install/upgrade: subprocess installed post-installation script returned error exit status 4
UpgradeStatus: No upgrade log present (probably fresh install)
To manage notifications about this bug go to:
https://bugs.launchpad.net/ubuntu/+source/python3-defaults/+bug/1024204/+subscriptions
More information about the foundations-bugs
mailing list