[Bug 1182684] Re: package python-imaging 1.1.7-4 failed to install/upgrade: subprocess installed post-installation script returned error exit status 101

Ubuntu Foundations Team Bug Bot 1182684 at bugs.launchpad.net
Wed May 22 00:16:51 UTC 2013


Thank you for taking the time to report this bug and helping to make
Ubuntu better.  Reviewing your dmesg attachment in this bug report it
seems that there is a problem with your hardware.  I recommend
performing a back up and then investigating the situation.  Measures you
might take include checking cable connections and using software tools
to investigate the health of your hardware.  In the event that is is not
in fact an error with your hardware please set the bug's status back to
New.  Thanks and good luck!

[This is an automated message.  I apologize if it reached you
inappropriately; please just reply to this message indicating so.]

** Tags added: hardware-error

** Changed in: python-imaging (Ubuntu)
   Importance: Undecided => Low

** Changed in: python-imaging (Ubuntu)
       Status: New => Invalid

-- 
You received this bug notification because you are a member of Ubuntu
Foundations Bugs, which is subscribed to python-imaging in Ubuntu.
https://bugs.launchpad.net/bugs/1182684

Title:
  package python-imaging 1.1.7-4 failed to install/upgrade: subprocess
  installed post-installation script returned error exit status 101

Status in “python-imaging” package in Ubuntu:
  Invalid

Bug description:
  TECRA-A9:~$ sudo apt-get install
  Reading package lists... Done
  Building dependency tree       
  Reading state information... Done
  The following packages were automatically installed and are no longer required:
    linux-headers-3.2.0-30 linux-headers-3.2.0-30-generic-pae
    linux-headers-3.2.0-30-generic
  Use 'apt-get autoremove' to remove them.
  0 upgraded, 0 newly installed, 0 to remove and 54 not upgraded.
  14 not fully installed or removed.
  After this operation, 0 B of additional disk space will be used.
  Setting up python-imaging (1.1.7-4) ...
  [Errno 5] Input/output error
  dpkg: error processing python-imaging (--configure):
   subprocess installed post-installation script returned error exit status 101
  dpkg: dependency problems prevent configuration of gwibber-service:
   gwibber-service depends on python-imaging; however:
    Package python-imaging is not configured yet.
  dpkg: error processing gwibber-service (--configure):
   dependency problems - leaving unconfigured
  dpkg: dependency problems prevent configuration of libgwibber2:
   libgwibber2 depends on gwibber-service (>= 2.31.1); however:
    Package gwibber-service is not configured yet.
  dpkg: error processing libgwibber2 (--configure):
   dependency problems - leaving unconfigured
  dpkg: dependency problems prevent configuration of libgwibber-gtk2:
   libgwibber-gtk2 depends on libgwibber2 (>= 3.3.90); however:
    Package libgwibber2 is not configured yet.
  dpkg: error processing libgwibber-gtk2 (--configure):
   dependency problems - leaving unconfigured
  dpkg: dependency problems prevent configuration of gwibber:
   gwibbNo apport report written because the error message indicates its a followup error from a previous failure.
                                  No apport report written because the error message indicates its a followup error from a previous failure.
                                                            No apport report written because MaxReports is reached already
                                          No apport report written because MaxReports is reached already
                        No apport report written because MaxReports is reached already
      No apport report written because MaxReports is reached already
                                                                    No apport report written because MaxReports is reached already
                                                  No apport report written because MaxReports is reached already
                                No apport report written because MaxReports is reached already
              No apport report written because MaxReports is reached already
                                                                            No apport report written because MaxReports is reached already
                                                          er depends on libgwibber-gtk2 (>= 3.1.4.1+r1119); however:
    Package libgwibber-gtk2 is not configured yet.
   gwibber depends on libgwibber2 (>= 3.1.4.1); however:
    Package libgwibber2 is not configured yet.
   gwibber depends on gwibber-service (= 3.4.2-0ubuntu2); however:
    Package gwibber-service is not configured yet.
  dpkg: error processing gwibber (--configure):
   dependency problems - leaving unconfigured
  dpkg: dependency problems prevent configuration of gwibber-service-facebook:
   gwibber-service-facebook depends on gwibber-service (>> 2.33.0); however:
    Package gwibber-service is not configured yet.
  dpkg: error processing gwibber-service-facebook (--configure):
   dependency problems - leaving unconfigured
  dpkg: dependency problems prevent configuration of gwibber-service-identica:
   gwibber-service-identica depends on gwibber-service (>> 2.33.0); however:
    Package gwibber-service is not configured yet.
  dpkg: error processing gwibber-service-identica (--configure):
   dependency problems - No apport report written because MaxReports is reached already
       No apport report written because MaxReports is reached already
                                                                     leaving unconfigured
  dpkg: dependency problems prevent configuration of gwibber-service-twitter:
   gwibber-service-twitter depends on gwibber-service (>> 2.33.0); however:
    Package gwibber-service is not configured yet.
  dpkg: error processing gwibber-service-twitter (--configure):
   dependency problems - leaving unconfigured
  dpkg: dependency problems prevent configuration of hplip:
   hplip depends on python-imaging; however:
    Package python-imaging is not configured yet.
  dpkg: error processing hplip (--configure):
   dependency problems - leaving unconfigured
  dpkg: dependency problems prevent configuration of printer-driver-postscript-hp:
   printer-driver-postscript-hp depends on hplip (>= 3.12.2-1ubuntu3.1); however:
    Package hplip is not configured yet.
  dpkg: error processing printer-driver-postscript-hp (--configure):
   dependency problems - leaving unconfigured
  dpkg: dependency problems prevent configuration of python-uniconvertor:
   python-uniconvertor depends on python-imaging; however:
    Package python-imaging is not configured yet.
  dpkg: error processing python-uniconvertor (--configure):
   dependency problems - leaving unconfigured
  dpkg: dependency problems prevent configuration of oneconf:
   oneconf depends on python-imaging; however:
    Package python-imaging is not configured yet.
  dpkg: error processing oneconf (--configure):
   dependency problems - leaving unconfigured
  dpkg: dependency problems prevent configuration of software-center:
   software-center depends on oneconf (>= 0.2.6); however:
    Package oneconf is not configured yet.
  dpkg: error processing software-center (--configure):
   dependency problems - leaving unconfigured
  dpkg: dependency problems prevent configuration of ubuntu-desktop:
   ubuntu-desktop depends on software-center; however:
    Package software-center is not configured yet.
  dpkg: error processing ubuntu-desktop (--configure):
   dependency problems - leaving unconfigured
  Errors were encountered while processing:
   python-imaging
   gwibber-service
   libgwibber2
   libgwibber-gtk2
   gwibber
   gwibber-service-facebook
   gwibber-service-identica
   gwibber-service-twitter
   hplip
   printer-driver-postscript-hp
   python-uniconvertor
   oneconf
   software-center
   ubuntu-desktop
  E: Sub-process /usr/bin/dpkg returned an error code (1)

  ProblemType: Package
  DistroRelease: Ubuntu 12.04
  Package: python-imaging 1.1.7-4
  ProcVersionSignature: Ubuntu 3.2.0-41.66-generic 3.2.42
  Uname: Linux 3.2.0-41-generic i686
  ApportVersion: 2.0.1-0ubuntu17.2
  Architecture: i386
  Date: Tue May 21 19:22:08 2013
  DpkgHistoryLog:
   Start-Date: 2013-05-21  19:21:13
   Commandline: apt-get install
  DuplicateSignature:
   Setting up python-imaging (1.1.7-4) ...
   [Errno 5] Input/output error
   dpkg: error processing python-imaging (--configure):
    subprocess installed post-installation script returned error exit status 101
  ErrorMessage: subprocess installed post-installation script returned error exit status 101
  InstallationMedia: Ubuntu 11.04 "Natty Narwhal" - Release i386 (20110427.1)
  MarkForUpload: True
  SourcePackage: python-imaging
  Title: package python-imaging 1.1.7-4 failed to install/upgrade: subprocess installed post-installation script returned error exit status 101
  UpgradeStatus: Upgraded to precise on 2012-09-17 (246 days ago)

To manage notifications about this bug go to:
https://bugs.launchpad.net/ubuntu/+source/python-imaging/+bug/1182684/+subscriptions




More information about the foundations-bugs mailing list