[Bug 1161809] [NEW] uuid-dev package fail to link on Raring Ringtail
Adrián Arroyo Calle
adrian.arroyocalle at gmail.com
Fri Mar 29 10:05:25 UTC 2013
Public bug reported:
I try to use libuuid and I install uuid-dev package. In my computer with Ubuntu 12.04 LTS works fine and in Launchpad builders works in Precise and Quantal, but in Raring (i386, amd64 and armhf) I get an strange error. I think that is a bug because the error doesn`t appear in older versions.
Error:
Linking CXX executable AZPAZETA_JUNO
/usr/bin/ld: CMakeFiles/AZPAZETA_JUNO.dir/src/pathfinder/pathfinder.cpp.o: undefined reference to symbol 'uuid_generate_random@@UUID_1.0'
/usr/bin/ld: note: 'uuid_generate_random@@UUID_1.0' is defined in DSO /lib/i386-linux-gnu/libuuid.so.1 so try adding it to the linker command line
/lib/i386-linux-gnu/libuuid.so.1: could not read symbols: Invalid operation
collect2: error: ld returned 1 exit status
The full log is here: https://launchpadlibrarian.net/135549121
/buildlog_ubuntu-
raring-i386.azpazeta_2.0.0.0-0~36~raring1_FAILEDTOBUILD.txt.gz
** Affects: util-linux (Ubuntu)
Importance: Undecided
Status: New
--
You received this bug notification because you are a member of Ubuntu
Foundations Bugs, which is subscribed to util-linux in Ubuntu.
https://bugs.launchpad.net/bugs/1161809
Title:
uuid-dev package fail to link on Raring Ringtail
Status in “util-linux” package in Ubuntu:
New
Bug description:
I try to use libuuid and I install uuid-dev package. In my computer with Ubuntu 12.04 LTS works fine and in Launchpad builders works in Precise and Quantal, but in Raring (i386, amd64 and armhf) I get an strange error. I think that is a bug because the error doesn`t appear in older versions.
Error:
Linking CXX executable AZPAZETA_JUNO
/usr/bin/ld: CMakeFiles/AZPAZETA_JUNO.dir/src/pathfinder/pathfinder.cpp.o: undefined reference to symbol 'uuid_generate_random@@UUID_1.0'
/usr/bin/ld: note: 'uuid_generate_random@@UUID_1.0' is defined in DSO /lib/i386-linux-gnu/libuuid.so.1 so try adding it to the linker command line
/lib/i386-linux-gnu/libuuid.so.1: could not read symbols: Invalid operation
collect2: error: ld returned 1 exit status
The full log is here: https://launchpadlibrarian.net/135549121
/buildlog_ubuntu-
raring-i386.azpazeta_2.0.0.0-0~36~raring1_FAILEDTOBUILD.txt.gz
To manage notifications about this bug go to:
https://bugs.launchpad.net/ubuntu/+source/util-linux/+bug/1161809/+subscriptions
More information about the foundations-bugs
mailing list