[Bug 1191818] [NEW] ndiswrapper-dkms 1.57-1ubuntu1: ndiswrapper kernel module failed to build

Roger Clark rfclark at gmail.com
Mon Jun 17 14:24:32 UTC 2013


Public bug reported:

I was updating from the 3.2.0-48 kernel on 12.04.2 LTS to the 3.5.0-34 kernel via 
> sudo apt-get install linux-generic-lts-quantal xserver-xorg-lts-quantal

In the post install script:

Examining /etc/kernel/header_postinst.d.
run-parts: executing /etc/kernel/header_postinst.d/dkms 3.5.0-34-generic /boot/vmlinuz-3.5.0-34-generic
Error! Could not locate dkms.conf file.
File:  does not exist.
Error! Bad return status for module build on kernel: 3.5.0-34-generic (x86_64)
Consult /var/lib/dkms/ndiswrapper/1.57/build/make.log for more information.

make.log has:
DKMS make.log for ndiswrapper-1.57 for kernel 3.5.0-34-generic (x86_64)
Mon Jun 17 10:11:20 EDT 2013
make -C /usr/src/linux-headers-3.5.0-34-generic M=/var/lib/dkms/ndiswrapper/1.57
/build
make[1]: Entering directory `/usr/src/linux-headers-3.5.0-34-generic'
  LD      /var/lib/dkms/ndiswrapper/1.57/build/built-in.o
  MKEXPORT /var/lib/dkms/ndiswrapper/1.57/build/crt_exports.h
  MKEXPORT /var/lib/dkms/ndiswrapper/1.57/build/hal_exports.h
  MKEXPORT /var/lib/dkms/ndiswrapper/1.57/build/ndis_exports.h
  MKEXPORT /var/lib/dkms/ndiswrapper/1.57/build/ntoskernel_exports.h
  MKEXPORT /var/lib/dkms/ndiswrapper/1.57/build/ntoskernel_io_exports.h
  MKEXPORT /var/lib/dkms/ndiswrapper/1.57/build/rtl_exports.h
  MKEXPORT /var/lib/dkms/ndiswrapper/1.57/build/usb_exports.h
  MKSTUBS /var/lib/dkms/ndiswrapper/1.57/build/win2lin_stubs.h
  CC [M]  /var/lib/dkms/ndiswrapper/1.57/build/crt.o
  CC [M]  /var/lib/dkms/ndiswrapper/1.57/build/hal.o
  CC [M]  /var/lib/dkms/ndiswrapper/1.57/build/iw_ndis.o
  CC [M]  /var/lib/dkms/ndiswrapper/1.57/build/loader.o
  CC [M]  /var/lib/dkms/ndiswrapper/1.57/build/ndis.o
/var/lib/dkms/ndiswrapper/1.57/build/ndis.c: In function ‘NdisGetCurrentProcesso
rCounts’:
/var/lib/dkms/ndiswrapper/1.57/build/ndis.c:2657:24: error: ‘struct kernel_stat’
 has no member named ‘cpustat’
/var/lib/dkms/ndiswrapper/1.57/build/ndis.c:2658:31: error: ‘struct kernel_stat’
 has no member named ‘cpustat’
/var/lib/dkms/ndiswrapper/1.57/build/ndis.c:2659:17: error: ‘struct kernel_stat’
 has no member named ‘cpustat’
make[2]: *** [/var/lib/dkms/ndiswrapper/1.57/build/ndis.o] Error 1
make[1]: *** [_module_/var/lib/dkms/ndiswrapper/1.57/build] Error 2
make[1]: Leaving directory `/usr/src/linux-headers-3.5.0-34-generic'
make: *** [modules] Error 2


dkms is installed on this machine but I have not used as I am running
all stock and precompiled drivers.

ProblemType: Package
DistroRelease: Ubuntu 12.04
Package: ndiswrapper-dkms 1.57-1ubuntu1
ProcVersionSignature: Ubuntu 3.2.0-48.74-generic 3.2.46
Uname: Linux 3.2.0-48-generic x86_64
NonfreeKernelModules: wl
ApportVersion: 2.0.1-0ubuntu17.3
Architecture: amd64
DKMSKernelVersion: 3.5.0-34-generic
Date: Mon Jun 17 10:10:29 2013
InstallationMedia: Ubuntu 10.04.4 LTS "Lucid Lynx" - Release amd64 (20120214)
MarkForUpload: True
PackageArchitecture: all
PackageVersion: 1.57-1ubuntu1
SourcePackage: ndiswrapper
Title: ndiswrapper-dkms 1.57-1ubuntu1: ndiswrapper kernel module failed to build
UpgradeStatus: Upgraded to precise on 2013-02-14 (122 days ago)

** Affects: ndiswrapper (Ubuntu)
     Importance: Undecided
         Status: New


** Tags: amd64 apport-package precise

-- 
You received this bug notification because you are a member of Ubuntu
Foundations Bugs, which is subscribed to ndiswrapper in Ubuntu.
https://bugs.launchpad.net/bugs/1191818

Title:
  ndiswrapper-dkms 1.57-1ubuntu1: ndiswrapper kernel module failed to
  build

Status in “ndiswrapper” package in Ubuntu:
  New

Bug description:
  I was updating from the 3.2.0-48 kernel on 12.04.2 LTS to the 3.5.0-34 kernel via 
  > sudo apt-get install linux-generic-lts-quantal xserver-xorg-lts-quantal

  In the post install script:

  Examining /etc/kernel/header_postinst.d.
  run-parts: executing /etc/kernel/header_postinst.d/dkms 3.5.0-34-generic /boot/vmlinuz-3.5.0-34-generic
  Error! Could not locate dkms.conf file.
  File:  does not exist.
  Error! Bad return status for module build on kernel: 3.5.0-34-generic (x86_64)
  Consult /var/lib/dkms/ndiswrapper/1.57/build/make.log for more information.

  make.log has:
  DKMS make.log for ndiswrapper-1.57 for kernel 3.5.0-34-generic (x86_64)
  Mon Jun 17 10:11:20 EDT 2013
  make -C /usr/src/linux-headers-3.5.0-34-generic M=/var/lib/dkms/ndiswrapper/1.57
  /build
  make[1]: Entering directory `/usr/src/linux-headers-3.5.0-34-generic'
    LD      /var/lib/dkms/ndiswrapper/1.57/build/built-in.o
    MKEXPORT /var/lib/dkms/ndiswrapper/1.57/build/crt_exports.h
    MKEXPORT /var/lib/dkms/ndiswrapper/1.57/build/hal_exports.h
    MKEXPORT /var/lib/dkms/ndiswrapper/1.57/build/ndis_exports.h
    MKEXPORT /var/lib/dkms/ndiswrapper/1.57/build/ntoskernel_exports.h
    MKEXPORT /var/lib/dkms/ndiswrapper/1.57/build/ntoskernel_io_exports.h
    MKEXPORT /var/lib/dkms/ndiswrapper/1.57/build/rtl_exports.h
    MKEXPORT /var/lib/dkms/ndiswrapper/1.57/build/usb_exports.h
    MKSTUBS /var/lib/dkms/ndiswrapper/1.57/build/win2lin_stubs.h
    CC [M]  /var/lib/dkms/ndiswrapper/1.57/build/crt.o
    CC [M]  /var/lib/dkms/ndiswrapper/1.57/build/hal.o
    CC [M]  /var/lib/dkms/ndiswrapper/1.57/build/iw_ndis.o
    CC [M]  /var/lib/dkms/ndiswrapper/1.57/build/loader.o
    CC [M]  /var/lib/dkms/ndiswrapper/1.57/build/ndis.o
  /var/lib/dkms/ndiswrapper/1.57/build/ndis.c: In function ‘NdisGetCurrentProcesso
  rCounts’:
  /var/lib/dkms/ndiswrapper/1.57/build/ndis.c:2657:24: error: ‘struct kernel_stat’
   has no member named ‘cpustat’
  /var/lib/dkms/ndiswrapper/1.57/build/ndis.c:2658:31: error: ‘struct kernel_stat’
   has no member named ‘cpustat’
  /var/lib/dkms/ndiswrapper/1.57/build/ndis.c:2659:17: error: ‘struct kernel_stat’
   has no member named ‘cpustat’
  make[2]: *** [/var/lib/dkms/ndiswrapper/1.57/build/ndis.o] Error 1
  make[1]: *** [_module_/var/lib/dkms/ndiswrapper/1.57/build] Error 2
  make[1]: Leaving directory `/usr/src/linux-headers-3.5.0-34-generic'
  make: *** [modules] Error 2



  dkms is installed on this machine but I have not used as I am running
  all stock and precompiled drivers.

  ProblemType: Package
  DistroRelease: Ubuntu 12.04
  Package: ndiswrapper-dkms 1.57-1ubuntu1
  ProcVersionSignature: Ubuntu 3.2.0-48.74-generic 3.2.46
  Uname: Linux 3.2.0-48-generic x86_64
  NonfreeKernelModules: wl
  ApportVersion: 2.0.1-0ubuntu17.3
  Architecture: amd64
  DKMSKernelVersion: 3.5.0-34-generic
  Date: Mon Jun 17 10:10:29 2013
  InstallationMedia: Ubuntu 10.04.4 LTS "Lucid Lynx" - Release amd64 (20120214)
  MarkForUpload: True
  PackageArchitecture: all
  PackageVersion: 1.57-1ubuntu1
  SourcePackage: ndiswrapper
  Title: ndiswrapper-dkms 1.57-1ubuntu1: ndiswrapper kernel module failed to build
  UpgradeStatus: Upgraded to precise on 2013-02-14 (122 days ago)

To manage notifications about this bug go to:
https://bugs.launchpad.net/ubuntu/+source/ndiswrapper/+bug/1191818/+subscriptions




More information about the foundations-bugs mailing list