[Bug 1095887] Re: package libpam-modules 1.1.3-7ubuntu4 failed to install/upgrade: trying to overwrite shared '/usr/share/man/man8/pam_group.8.gz', which is different from other instances of package libpam-modules:i386
Anders Kaseorg
andersk at mit.edu
Fri Jan 4 01:37:36 UTC 2013
It looks like the amd64 and i386 packages got built against different
versions of docbook-xsl, leading to this difference:
$ zdiff -U0 {amd64,i386}/usr/share/man/man8/pam_group.8.gz
--- /dev/fd/5 2013-01-03 20:35:47.813676958 -0500
+++ - 2013-01-03 20:35:47.822657041 -0500
@@ -4,2 +4,2 @@
-.\" Generator: DocBook XSL Stylesheets v1.75.2 <http://docbook.sf.net/>
-.\" Date: 06/04/2011
+.\" Generator: DocBook XSL Stylesheets v1.76.1 <http://docbook.sf.net/>
+.\" Date: 01/03/2013
@@ -10 +10 @@
-.TH "PAM_GROUP" "8" "06/04/2011" "Linux-PAM Manual" "Linux-PAM Manual"
+.TH "PAM_GROUP" "8" "01/03/2013" "Linux-PAM Manual" "Linux-PAM Manual"
--
You received this bug notification because you are a member of Ubuntu
Foundations Bugs, which is subscribed to pam in Ubuntu.
https://bugs.launchpad.net/bugs/1095887
Title:
package libpam-modules 1.1.3-7ubuntu4 failed to install/upgrade:
trying to overwrite shared '/usr/share/man/man8/pam_group.8.gz', which
is different from other instances of package libpam-modules:i386
Status in “pam” package in Ubuntu:
New
Bug description:
Preparing to replace libpam-modules:amd64 1.1.3-7ubuntu3 (using .../libpam-modules_1.1.3-7ubuntu4_amd64.deb) ...
De-configuring libpam-modules:i386 ...
Unpacking replacement libpam-modules:amd64 ...
Preparing to replace libpam-modules:i386 1.1.3-7ubuntu3 (using .../libpam-modules_1.1.3-7ubuntu4_i386.deb) ...
Unpacking replacement libpam-modules:i386 ...
dpkg: error processing /var/cache/apt/archives/libpam-modules_1.1.3-7ubuntu4_i386.deb (--unpack):
trying to overwrite shared '/usr/share/man/man8/pam_group.8.gz', which is different from other instances of package libpam-modules:i386
dpkg-deb: error: subprocess paste was killed by signal (Broken pipe)
Processing triggers for man-db ...
Errors were encountered while processing:
/var/cache/apt/archives/libpam-modules_1.1.3-7ubuntu4_i386.deb
E: Sub-process /usr/bin/dpkg returned an error code (1)
ProblemType: Package
DistroRelease: Ubuntu 13.04
Package: libpam-modules 1.1.3-7ubuntu4
ProcVersionSignature: Ubuntu 3.7.0-7.15-generic 3.7.0
Uname: Linux 3.7.0-7-generic x86_64
NonfreeKernelModules: openafs
ApportVersion: 2.7-0ubuntu2
Architecture: amd64
Date: Thu Jan 3 20:29:13 2013
DuplicateSignature:
Unpacking replacement libpam-modules:i386 ...
dpkg: error processing /var/cache/apt/archives/libpam-modules_1.1.3-7ubuntu4_i386.deb (--unpack):
trying to overwrite shared '/usr/share/man/man8/pam_group.8.gz', which is different from other instances of package libpam-modules:i386
ErrorMessage: trying to overwrite shared '/usr/share/man/man8/pam_group.8.gz', which is different from other instances of package libpam-modules:i386
InstallationDate: Installed on 2010-12-05 (760 days ago)
InstallationMedia: Ubuntu 11.04 "Natty Narwhal" - Alpha amd64 (20101202)
MarkForUpload: True
SourcePackage: pam
Title: package libpam-modules 1.1.3-7ubuntu4 failed to install/upgrade: trying to overwrite shared '/usr/share/man/man8/pam_group.8.gz', which is different from other instances of package libpam-modules:i386
UpgradeStatus: Upgraded to raring on 2012-11-15 (49 days ago)
To manage notifications about this bug go to:
https://bugs.launchpad.net/ubuntu/+source/pam/+bug/1095887/+subscriptions
More information about the foundations-bugs
mailing list