[Bug 1120465] Re: ndiswrapper-dkms 1.57-1ubuntu1: ndiswrapper kernel module failed to build
Daniel van Vugt
daniel.van.vugt at canonical.com
Tue Feb 12 03:03:25 UTC 2013
*** This bug is a duplicate of bug 1023645 ***
https://bugs.launchpad.net/bugs/1023645
Thank you for taking the time to report this bug and helping to make
Ubuntu better. This particular bug has already been reported and is a
duplicate of bug 1023645, so it is being marked as such. Please look at
the other bug report to see if there is any missing information that you
can provide, or to see if there is a workaround for the bug.
Additionally, any further discussion regarding the bug should occur in
the other report. Feel free to continue to report any other bugs you may
find.
** This bug has been marked a duplicate of bug 1023645
ndiswrapper-dkms 1.57-1ubuntu1: ndiswrapper kernel module failed to build [error: ‘struct kernel_stat’ has no member named ‘cpustat’]
--
You received this bug notification because you are a member of Ubuntu
Foundations Bugs, which is subscribed to ndiswrapper in Ubuntu.
https://bugs.launchpad.net/bugs/1120465
Title:
ndiswrapper-dkms 1.57-1ubuntu1: ndiswrapper kernel module failed to
build
Status in “ndiswrapper” package in Ubuntu:
New
Bug description:
cat /var/lib/dkms/ndiswrapper/1.57/build/make.log
DKMS make.log for ndiswrapper-1.57 for kernel 3.5.0-24-generic (x86_64)
Sat Feb 9 20:08:05 AST 2013
make -C /usr/src/linux-headers-3.5.0-24-generic M=/var/lib/dkms/ndiswrapper/1.57/build
make[1]: Entering directory `/usr/src/linux-headers-3.5.0-24-generic'
LD /var/lib/dkms/ndiswrapper/1.57/build/built-in.o
MKEXPORT /var/lib/dkms/ndiswrapper/1.57/build/crt_exports.h
MKEXPORT /var/lib/dkms/ndiswrapper/1.57/build/hal_exports.h
MKEXPORT /var/lib/dkms/ndiswrapper/1.57/build/ndis_exports.h
MKEXPORT /var/lib/dkms/ndiswrapper/1.57/build/ntoskernel_exports.h
MKEXPORT /var/lib/dkms/ndiswrapper/1.57/build/ntoskernel_io_exports.h
MKEXPORT /var/lib/dkms/ndiswrapper/1.57/build/rtl_exports.h
MKEXPORT /var/lib/dkms/ndiswrapper/1.57/build/usb_exports.h
MKSTUBS /var/lib/dkms/ndiswrapper/1.57/build/win2lin_stubs.h
CC [M] /var/lib/dkms/ndiswrapper/1.57/build/crt.o
CC [M] /var/lib/dkms/ndiswrapper/1.57/build/hal.o
CC [M] /var/lib/dkms/ndiswrapper/1.57/build/iw_ndis.o
CC [M] /var/lib/dkms/ndiswrapper/1.57/build/loader.o
CC [M] /var/lib/dkms/ndiswrapper/1.57/build/ndis.o
/var/lib/dkms/ndiswrapper/1.57/build/ndis.c: In function ‘NdisGetCurrentProcessorCounts’:
/var/lib/dkms/ndiswrapper/1.57/build/ndis.c:2657:24: error: ‘struct kernel_stat’ has no member named ‘cpustat’
/var/lib/dkms/ndiswrapper/1.57/build/ndis.c:2658:31: error: ‘struct kernel_stat’ has no member named ‘cpustat’
/var/lib/dkms/ndiswrapper/1.57/build/ndis.c:2659:17: error: ‘struct kernel_stat’ has no member named ‘cpustat’
make[2]: *** [/var/lib/dkms/ndiswrapper/1.57/build/ndis.o] Error 1
make[1]: *** [_module_/var/lib/dkms/ndiswrapper/1.57/build] Error 2
make[1]: Leaving directory `/usr/src/linux-headers-3.5.0-24-generic'
make: *** [modules] Error 2
apt-get install --reinstall ndiswrapper-dkms
Reading package lists... Done
Building dependency tree
Reading state information... Done
0 upgraded, 0 newly installed, 1 reinstalled, 0 to remove and 0 not upgraded.
Need to get 0 B/176 kB of archives.
After this operation, 0 B of additional disk space will be used.
(Reading database ... 242805 files and directories currently installed.)
Preparing to replace ndiswrapper-dkms 1.57-1ubuntu1 (using .../ndiswrapper-dkms_1.57-1ubuntu1_all.deb) ...
------------------------------
Deleting module version: 1.57
completely from the DKMS tree.
------------------------------
Done.
Unpacking replacement ndiswrapper-dkms ...
Setting up ndiswrapper-dkms (1.57-1ubuntu1) ...
Loading new ndiswrapper-1.57 DKMS files...
Building only for 3.5.0-24-generic
Building initial module for 3.5.0-24-generic
Error! Bad return status for module build on kernel: 3.5.0-24-generic (x86_64)
Consult /var/lib/dkms/ndiswrapper/1.57/build/make.log for more information.
uname -a
Linux clump 3.5.0-24-generic #37-Ubuntu SMP Thu Feb 7 01:50:30 UTC 2013 x86_64 x86_64 x86_64 GNU/Linux
ProblemType: Package
DistroRelease: Ubuntu 12.10
Package: ndiswrapper-dkms 1.57-1ubuntu1
ProcVersionSignature: Ubuntu 3.5.0-24.37-generic 3.5.7.4
Uname: Linux 3.5.0-24-generic x86_64
ApportVersion: 2.6.1-0ubuntu10
Architecture: amd64
DKMSKernelVersion: 3.5.0-24-generic
Date: Sat Feb 9 20:08:13 2013
InstallationDate: Installed on 2013-02-08 (0 days ago)
InstallationMedia: Ubuntu 12.10 "Quantal Quetzal" - Release amd64 (20121017.5)
MarkForUpload: True
PackageArchitecture: all
PackageVersion: 1.57-1ubuntu1
SourcePackage: ndiswrapper
Title: ndiswrapper-dkms 1.57-1ubuntu1: ndiswrapper kernel module failed to build
UpgradeStatus: No upgrade log present (probably fresh install)
To manage notifications about this bug go to:
https://bugs.launchpad.net/ubuntu/+source/ndiswrapper/+bug/1120465/+subscriptions
More information about the foundations-bugs
mailing list