[Bug 1263493] [NEW] strange python compileall bug during paraview build
Dimitri John Ledkov
launchpad at surgut.co.uk
Sun Dec 22 15:06:06 UTC 2013
Public bug reported:
Traceback (most recent call last):
File "/build/buildd/paraview-4.0.1/obj-i686-linux-gnu/Web/Python/compile_py", line 2, in <module>
compile_dir('/build/buildd/paraview-4.0.1/obj-i686-linux-gnu/lib/site-packages/paraview')
File "/usr/lib/python2.7/compileall.py", line 50, in compile_dir
if not compile_file(fullname, ddir, force, rx, quiet):
File "/usr/lib/python2.7/compileall.py", line 99, in compile_file
ok = py_compile.compile(fullname, None, dfile, True)
File "/usr/lib/python2.7/py_compile.py", line 137, in compile
os.unlink(path_tmp)
OSError: [Errno 2] No such file or directory: '/build/buildd/paraview-4.0.1/obj-i686-linux-gnu/lib/site-packages/paraview/simple_server.pyc.1434287304'
make[3]: *** [lib/site-packages/paraview/ParaViewWebPython_complete] Error 1
make[3]: Leaving directory `/build/buildd/paraview-4.0.1/obj-i686-linux-gnu'
make[2]: *** [Web/Python/CMakeFiles/ParaViewWebPyt
** Affects: paraview (Ubuntu)
Importance: Undecided
Status: New
** Affects: python2.7 (Ubuntu)
Importance: Undecided
Status: New
** Tags: ftbfs i386
** Also affects: python2.7 (Ubuntu)
Importance: Undecided
Status: New
** Tags added: ftbfs i386
--
You received this bug notification because you are a member of Ubuntu
Foundations Bugs, which is subscribed to python2.7 in Ubuntu.
https://bugs.launchpad.net/bugs/1263493
Title:
strange python compileall bug during paraview build
Status in “paraview” package in Ubuntu:
New
Status in “python2.7” package in Ubuntu:
New
Bug description:
Traceback (most recent call last):
File "/build/buildd/paraview-4.0.1/obj-i686-linux-gnu/Web/Python/compile_py", line 2, in <module>
compile_dir('/build/buildd/paraview-4.0.1/obj-i686-linux-gnu/lib/site-packages/paraview')
File "/usr/lib/python2.7/compileall.py", line 50, in compile_dir
if not compile_file(fullname, ddir, force, rx, quiet):
File "/usr/lib/python2.7/compileall.py", line 99, in compile_file
ok = py_compile.compile(fullname, None, dfile, True)
File "/usr/lib/python2.7/py_compile.py", line 137, in compile
os.unlink(path_tmp)
OSError: [Errno 2] No such file or directory: '/build/buildd/paraview-4.0.1/obj-i686-linux-gnu/lib/site-packages/paraview/simple_server.pyc.1434287304'
make[3]: *** [lib/site-packages/paraview/ParaViewWebPython_complete] Error 1
make[3]: Leaving directory `/build/buildd/paraview-4.0.1/obj-i686-linux-gnu'
make[2]: *** [Web/Python/CMakeFiles/ParaViewWebPyt
To manage notifications about this bug go to:
https://bugs.launchpad.net/ubuntu/+source/paraview/+bug/1263493/+subscriptions
More information about the foundations-bugs
mailing list