[Bug 1168802] Re: package python-dev 2.7.3-0ubuntu2 failed to install/upgrade: trying to overwrite '/usr/lib/pkgconfig/python2.pc', which is also in package python2.7 2.7.3-0ubuntu3.1
Micah Gersten
launchpad at micahscomputing.com
Sun Apr 14 09:04:05 UTC 2013
*** This bug is a duplicate of bug 1167177 ***
https://bugs.launchpad.net/bugs/1167177
** This bug has been marked a duplicate of bug 1167177
package python-dev 2.7.3-0ubuntu2 failed to install/upgrade: tentative de remplacement de « /usr/lib/pkgconfig/python2.pc », qui appartient aussi au paquet python2.7 2.7.3-0ubuntu3.1
--
You received this bug notification because you are a member of Ubuntu
Foundations Bugs, which is subscribed to python-defaults in Ubuntu.
https://bugs.launchpad.net/bugs/1168802
Title:
package python-dev 2.7.3-0ubuntu2 failed to install/upgrade: trying to
overwrite '/usr/lib/pkgconfig/python2.pc', which is also in package
python2.7 2.7.3-0ubuntu3.1
Status in “python-defaults” package in Ubuntu:
New
Bug description:
Attempted to install python-dev as a dependency to mysql-workbench and
hit this bug. It appears that the issue is that python-dev is
attempting to supply a python.pc file for pkg-config while 'python'
already does.
Preparing to replace python-dev 2.7.3-0ubuntu2 (using .../python-dev_2.7.3-0ubuntu2.1_amd64.deb) ...
Unpacking replacement python-dev ...
dpkg: error processing /var/cache/apt/archives/python-dev_2.7.3-0ubuntu2.1_amd64.deb (--unpack):
trying to overwrite '/usr/lib/pkgconfig/python2.pc', which is also in package python2.7 2.7.3-0ubuntu3.1
Processing triggers for man-db ...
Errors were encountered while processing:
/var/cache/apt/archives/python-dev_2.7.3-0ubuntu2.1_amd64.deb
E: Sub-process /usr/bin/dpkg returned an error code (1)
segin at darvos:~$ lsb_release -rd
Description: Ubuntu 12.04.2 LTS
Release: 12.04
ProblemType: Package
DistroRelease: Ubuntu 12.04
Package: python-dev 2.7.3-0ubuntu2
ProcVersionSignature: Ubuntu 3.2.0-39.62-generic 3.2.39
Uname: Linux 3.2.0-39-generic x86_64
NonfreeKernelModules: sep3_10 pax wl
ApportVersion: 2.0.1-0ubuntu17.1
Architecture: amd64
Date: Sun Apr 14 00:00:52 2013
DpkgTerminalLog:
Preparing to replace python-dev 2.7.3-0ubuntu2 (using .../python-dev_2.7.3-0ubuntu2.1_amd64.deb) ...
Unpacking replacement python-dev ...
dpkg: error processing /var/cache/apt/archives/python-dev_2.7.3-0ubuntu2.1_amd64.deb (--unpack):
trying to overwrite '/usr/lib/pkgconfig/python2.pc', which is also in package python2.7 2.7.3-0ubuntu3.1
DuplicateSignature:
Unpacking replacement python-dev ...
dpkg: error processing /var/cache/apt/archives/python-dev_2.7.3-0ubuntu2.1_amd64.deb (--unpack):
trying to overwrite '/usr/lib/pkgconfig/python2.pc', which is also in package python2.7 2.7.3-0ubuntu3.1
ErrorMessage: trying to overwrite '/usr/lib/pkgconfig/python2.pc', which is also in package python2.7 2.7.3-0ubuntu3.1
MarkForUpload: True
SourcePackage: python-defaults
Title: package python-dev 2.7.3-0ubuntu2 failed to install/upgrade: trying to overwrite '/usr/lib/pkgconfig/python2.pc', which is also in package python2.7 2.7.3-0ubuntu3.1
UpgradeStatus: No upgrade log present (probably fresh install)
To manage notifications about this bug go to:
https://bugs.launchpad.net/ubuntu/+source/python-defaults/+bug/1168802/+subscriptions
More information about the foundations-bugs
mailing list