[Bug 1006939] [NEW] package resolvconf 1.63ubuntu14 failed to install/upgrade: error writing to '<standard output>': Success

Chandan Thakur er.chandanthakur at gmail.com
Thu May 31 14:23:34 UTC 2012


Public bug reported:

I am getting error during updating the system.


please fix this issue ASAP.

ProblemType: Package
DistroRelease: Ubuntu 12.04
Package: resolvconf 1.63ubuntu14
ProcVersionSignature: Ubuntu 3.2.0-24.39-generic 3.2.16
Uname: Linux 3.2.0-24-generic x86_64
NonfreeKernelModules: wl
ApportVersion: 2.0.1-0ubuntu8
Architecture: amd64
Date: Thu May 31 19:40:38 2012
ErrorMessage: error writing to '<standard output>': Success
InstallationMedia: Ubuntu 12.04 LTS "Precise Pangolin" - Release amd64 (20120425)
PackageArchitecture: all
SourcePackage: resolvconf
Title: package resolvconf 1.63ubuntu14 failed to install/upgrade: error writing to '<standard output>': Success
UpgradeStatus: No upgrade log present (probably fresh install)

** Affects: resolvconf (Ubuntu)
     Importance: Undecided
         Status: New


** Tags: amd64 apport-package precise

-- 
You received this bug notification because you are a member of Ubuntu
Foundations Bugs, which is subscribed to resolvconf in Ubuntu.
https://bugs.launchpad.net/bugs/1006939

Title:
  package resolvconf 1.63ubuntu14 failed to install/upgrade: error
  writing to '<standard output>': Success

Status in “resolvconf” package in Ubuntu:
  New

Bug description:
  I am getting error during updating the system.

  
  please fix this issue ASAP.

  ProblemType: Package
  DistroRelease: Ubuntu 12.04
  Package: resolvconf 1.63ubuntu14
  ProcVersionSignature: Ubuntu 3.2.0-24.39-generic 3.2.16
  Uname: Linux 3.2.0-24-generic x86_64
  NonfreeKernelModules: wl
  ApportVersion: 2.0.1-0ubuntu8
  Architecture: amd64
  Date: Thu May 31 19:40:38 2012
  ErrorMessage: error writing to '<standard output>': Success
  InstallationMedia: Ubuntu 12.04 LTS "Precise Pangolin" - Release amd64 (20120425)
  PackageArchitecture: all
  SourcePackage: resolvconf
  Title: package resolvconf 1.63ubuntu14 failed to install/upgrade: error writing to '<standard output>': Success
  UpgradeStatus: No upgrade log present (probably fresh install)

To manage notifications about this bug go to:
https://bugs.launchpad.net/ubuntu/+source/resolvconf/+bug/1006939/+subscriptions




More information about the foundations-bugs mailing list