[Bug 1003100] Re: package-data-downloader: KeyError: 'paquetes'

Michael S Costello 1003100 at bugs.launchpad.net
Wed May 30 16:40:08 UTC 2012


When Attempting the procedure detailed at
https://wiki.ubuntu.com/Testing/EnableProposed:

Here is my result:

# sudo aptitude install update-notifier-common/precise-proposed
The following packages will be upgraded: 
  update-notifier-common 
The following partially installed packages will be configured:
  ttf-mscorefonts-installer update-notifier 
1 packages upgraded, 0 newly installed, 0 to remove and 24 not upgraded.
Need to get 0 B/221 kB of archives. After unpacking 0 B will be used.
Do you want to continue? [Y/n/?] Y
Setting up update-notifier-common (0.119ubuntu8.2) ...
ttf-mscorefonts-installer: downloading http://downloads.sourceforge.net/corefonts/andale32.exe
Traceback (most recent call last):
  File "/usr/lib/update-notifier/package-data-downloader", line 234, in process_download_requests
    dest_file = urllib.urlretrieve(files[i])[0]
  File "/usr/lib/python2.7/urllib.py", line 93, in urlretrieve
    return _urlopener.retrieve(url, filename, reporthook, data)
  File "/usr/lib/python2.7/urllib.py", line 239, in retrieve
    fp = self.open(url, data)
  File "/usr/lib/python2.7/urllib.py", line 207, in open
    return getattr(self, name)(url)
  File "/usr/lib/python2.7/urllib.py", line 344, in open_http
    h.endheaders(data)
  File "/usr/lib/python2.7/httplib.py", line 954, in endheaders
    self._send_output(message_body)
  File "/usr/lib/python2.7/httplib.py", line 814, in _send_output
    self.send(msg)
  File "/usr/lib/python2.7/httplib.py", line 776, in send
    self.connect()
  File "/usr/lib/python2.7/httplib.py", line 757, in connect
    self.timeout, self.source_address)
  File "/usr/lib/python2.7/socket.py", line 553, in create_connection
    for res in getaddrinfo(host, port, 0, SOCK_STREAM):
IOError: [Errno socket error] [Errno -2] Name or service not known
Traceback (most recent call last):
  File "/usr/lib/update-notifier/package-data-downloader", line 296, in <module>
    process_download_requests()
  File "/usr/lib/update-notifier/package-data-downloader", line 292, in process_download_requests
    trigger_update_notifier(our_failures)
  File "/usr/lib/update-notifier/package-data-downloader", line 150, in trigger_update_notifier
    {'packages' : ", ".join(packages)}))
  File "/usr/lib/python2.7/string.py", line 172, in substitute
    return self.pattern.sub(convert, self.template)
  File "/usr/lib/python2.7/string.py", line 162, in convert
    val = mapping[named]
KeyError: 'paquetes'
dpkg: error processing update-notifier-common (--configure):
 subprocess installed post-installation script returned error exit status 1
dpkg: dependency problems prevent configuration of ttf-mscorefonts-installer:
 ttf-mscorefonts-installer depends on update-notifier-common (>= 0.119ubuntu2); however:
  Package update-notifier-common is not configured yet.
dpkg: error processing ttf-mscorefonts-installer (--configure):
 dependency problems - leaving unconfigured
dpkg: dependency problems prevent configuration of update-notifier:
 update-notifier depends on update-notifier-common (= 0.119ubuntu8.4); however:
  Version of update-notifier-common on system is 0.119ubuntu8.2.
dpkg: error processing update-notifier (--configure):
 dependency problems - leaving unconfigured
No apport report written because the error message indicates its a followup error from a previous failure.
                          No apport report written because the error message indicates its a followup error from a previous failure.
                                                    Errors were encountered while processing:
 update-notifier-common
 ttf-mscorefonts-installer
 update-notifier
E: Sub-process /usr/bin/dpkg returned an error code (1)
A package failed to install.  Trying to recover:
dpkg: dependency problems prevent configuration of update-notifier:
 update-notifier depends on update-notifier-common (= 0.119ubuntu8.4); however:
  Version of update-notifier-common on system is 0.119ubuntu8.2.
dpkg: error processing update-notifier (--configure):
 dependency problems - leaving unconfigured
Setting up update-notifier-common (0.119ubuntu8.2) ...
ttf-mscorefonts-installer: downloading http://downloads.sourceforge.net/corefonts/andale32.exe
Traceback (most recent call last):
  File "/usr/lib/update-notifier/package-data-downloader", line 234, in process_download_requests
    dest_file = urllib.urlretrieve(files[i])[0]
  File "/usr/lib/python2.7/urllib.py", line 93, in urlretrieve
    return _urlopener.retrieve(url, filename, reporthook, data)
  File "/usr/lib/python2.7/urllib.py", line 239, in retrieve
    fp = self.open(url, data)
  File "/usr/lib/python2.7/urllib.py", line 207, in open
    return getattr(self, name)(url)
  File "/usr/lib/python2.7/urllib.py", line 344, in open_http
    h.endheaders(data)
  File "/usr/lib/python2.7/httplib.py", line 954, in endheaders
    self._send_output(message_body)
  File "/usr/lib/python2.7/httplib.py", line 814, in _send_output
    self.send(msg)
  File "/usr/lib/python2.7/httplib.py", line 776, in send
    self.connect()
  File "/usr/lib/python2.7/httplib.py", line 757, in connect
    self.timeout, self.source_address)
  File "/usr/lib/python2.7/socket.py", line 553, in create_connection
    for res in getaddrinfo(host, port, 0, SOCK_STREAM):
IOError: [Errno socket error] [Errno -2] Name or service not known
Traceback (most recent call last):
  File "/usr/lib/update-notifier/package-data-downloader", line 296, in <module>
    process_download_requests()
  File "/usr/lib/update-notifier/package-data-downloader", line 292, in process_download_requests
    trigger_update_notifier(our_failures)
  File "/usr/lib/update-notifier/package-data-downloader", line 150, in trigger_update_notifier
    {'packages' : ", ".join(packages)}))
  File "/usr/lib/python2.7/string.py", line 172, in substitute
    return self.pattern.sub(convert, self.template)
  File "/usr/lib/python2.7/string.py", line 162, in convert
    val = mapping[named]
KeyError: 'paquetes'
dpkg: error processing update-notifier-common (--configure):
 subprocess installed post-installation script returned error exit status 1
dpkg: dependency problems prevent configuration of ttf-mscorefonts-installer:
 ttf-mscorefonts-installer depends on update-notifier-common (>= 0.119ubuntu2); however:
  Package update-notifier-common is not configured yet.
dpkg: error processing ttf-mscorefonts-installer (--configure):
 dependency problems - leaving unconfigured
Errors were encountered while processing:
 update-notifier
 update-notifier-common
 ttf-mscorefonts-installer

-- 
You received this bug notification because you are a member of Ubuntu
Foundations Bugs, which is subscribed to update-notifier in Ubuntu.
https://bugs.launchpad.net/bugs/1003100

Title:
  package-data-downloader: KeyError: 'paquetes'

Status in “update-notifier” package in Ubuntu:
  Fix Committed
Status in “update-notifier” source package in Precise:
  Fix Committed
Status in “update-notifier” source package in Quantal:
  Fix Committed

Bug description:
  i have upgraded from 3 previous versions from 12.04 - had 1gb free space on / when the 12.04 upgrage was completing - or cleaning up stage - not sure if this is related. till the previous version of 12.04 - 11.10 - the upgrades were smooth.
  no big deal if u cant id this issue - worst case i can reformat. on my other laptop, switched to ubuntu with 11.10 and am happy it does my home entertainment and work.
  keep up the good work gents and ladies!

  ProblemType: Package
  DistroRelease: Ubuntu 12.04
  Package: update-notifier-common 0.119ubuntu8.2
  ProcVersionSignature: Ubuntu 3.2.0-24.38-generic 3.2.16
  Uname: Linux 3.2.0-24-generic i686
  ApportVersion: 2.0.1-0ubuntu7
  Architecture: i386
  Date: Tue May 22 23:00:34 2012
  ErrorMessage: ErrorMessage: subprocess installed post-installation script returned error exit status 1
  InstallationMedia: Ubuntu 10.04 LTS "Lucid Lynx" - Release i386 (20100429)
  PackageArchitecture: all
  SourcePackage: update-notifier
  Title: package update-notifier-common 0.119ubuntu8.2 failed to install/upgrade: ErrorMessage: subprocess installed post-installation script returned error exit status 1
  UpgradeStatus: Upgraded to precise on 2012-05-22 (0 days ago)

To manage notifications about this bug go to:
https://bugs.launchpad.net/ubuntu/+source/update-notifier/+bug/1003100/+subscriptions




More information about the foundations-bugs mailing list