[Bug 1005781] [NEW] package samba-common-bin 2:3.6.3-2ubuntu2 failed to install/upgrade: subprocess installed post-installation script returned error exit status 2
GROSSMANN
gerard-grossmann at orange.fr
Tue May 29 06:52:13 UTC 2012
Public bug reported:
message d erreur
ProblemType: Package
DistroRelease: Ubuntu 12.04
Package: samba-common-bin 2:3.6.3-2ubuntu2
ProcVersionSignature: Ubuntu 3.2.0-24.39-generic 3.2.16
Uname: Linux 3.2.0-24-generic i686
ApportVersion: 2.0.1-0ubuntu7
AptOrdering:
gedit: Configure
samba-common-bin: Configure
nautilus-share: Configure
ubuntu-desktop: Configure
Architecture: i386
Date: Tue May 29 08:41:52 2012
DuplicateSignature:
Setting up gedit (3.4.1-0ubuntu1) ...
update-alternatives: error: /var/lib/dpkg/alternatives/gnome-text-editor corrupt: line not terminated while trying to read status
dpkg: error processing gedit (--configure):
subprocess installed post-installation script returned error exit status 2
ErrorMessage: subprocess installed post-installation script returned error exit status 2
InstallationMedia: Ubuntu-Netbook 10.10 "Maverick Meerkat" - Release i386 (20101007)
SourcePackage: samba
Title: package samba-common-bin 2:3.6.3-2ubuntu2 failed to install/upgrade: subprocess installed post-installation script returned error exit status 2
UpgradeStatus: Upgraded to precise on 2012-04-30 (28 days ago)
** Affects: samba (Ubuntu)
Importance: Undecided
Status: New
** Tags: apport-package i386 precise
--
You received this bug notification because you are a member of Ubuntu
Foundations Bugs, which is subscribed to samba in Ubuntu.
https://bugs.launchpad.net/bugs/1005781
Title:
package samba-common-bin 2:3.6.3-2ubuntu2 failed to install/upgrade:
subprocess installed post-installation script returned error exit
status 2
Status in “samba” package in Ubuntu:
New
Bug description:
message d erreur
ProblemType: Package
DistroRelease: Ubuntu 12.04
Package: samba-common-bin 2:3.6.3-2ubuntu2
ProcVersionSignature: Ubuntu 3.2.0-24.39-generic 3.2.16
Uname: Linux 3.2.0-24-generic i686
ApportVersion: 2.0.1-0ubuntu7
AptOrdering:
gedit: Configure
samba-common-bin: Configure
nautilus-share: Configure
ubuntu-desktop: Configure
Architecture: i386
Date: Tue May 29 08:41:52 2012
DuplicateSignature:
Setting up gedit (3.4.1-0ubuntu1) ...
update-alternatives: error: /var/lib/dpkg/alternatives/gnome-text-editor corrupt: line not terminated while trying to read status
dpkg: error processing gedit (--configure):
subprocess installed post-installation script returned error exit status 2
ErrorMessage: subprocess installed post-installation script returned error exit status 2
InstallationMedia: Ubuntu-Netbook 10.10 "Maverick Meerkat" - Release i386 (20101007)
SourcePackage: samba
Title: package samba-common-bin 2:3.6.3-2ubuntu2 failed to install/upgrade: subprocess installed post-installation script returned error exit status 2
UpgradeStatus: Upgraded to precise on 2012-04-30 (28 days ago)
To manage notifications about this bug go to:
https://bugs.launchpad.net/ubuntu/+source/samba/+bug/1005781/+subscriptions
More information about the foundations-bugs
mailing list