[Bug 1001835] [NEW] package plymouth-theme-ubuntu-text 0.8.2-2ubuntu23 failed to install/upgrade: subprocess installed post-installation script returned error exit status 2

Chris Lynch xopherlynch at gmail.com
Sun May 20 02:19:47 UTC 2012


Public bug reported:

won't load or update

ProblemType: Package
DistroRelease: Ubuntu 11.04
Package: plymouth-theme-ubuntu-text 0.8.2-2ubuntu23
ProcVersionSignature: Ubuntu 2.6.38-15.59-generic 2.6.38.8
Uname: Linux 2.6.38-15-generic x86_64
NonfreeKernelModules: nvidia
Architecture: amd64
Date: Mon May 14 03:39:42 2012
DefaultPlymouth: /lib/plymouth/themes/satanic-logo/satanic-logo.plymouth
DpkgTerminalLog:
 Setting up plymouth-theme-ubuntu-text (0.8.2-2ubuntu23) ...
 update-alternatives: error: readlink(/etc/alternatives/text.plymouth) failed: Invalid argument
 dpkg: error processing plymouth-theme-ubuntu-text (--configure):
  subprocess installed post-installation script returned error exit status 2
ErrorMessage: subprocess installed post-installation script returned error exit status 2
InstallationMedia: Ubuntu Satanic Edition - amd64 (20110726)
MachineType: Hewlett-Packard Compaq Presario F700 Notebook PC
ProcFB:
 
ProcKernelCmdLine: BOOT_IMAGE=/boot/vmlinuz-2.6.38-15-generic root=UUID=ac726efa-25a0-4046-ad31-2c07507e253b ro single
SourcePackage: plymouth
TextPlymouth: Error: command ['readlink', '/etc/alternatives/text.plymouth'] failed with exit code 1:
Title: package plymouth-theme-ubuntu-text 0.8.2-2ubuntu23 failed to install/upgrade: subprocess installed post-installation script returned error exit status 2
UpgradeStatus: No upgrade log present (probably fresh install)
dmi.bios.date: 12/07/2007
dmi.bios.vendor: Hewlett-Packard
dmi.bios.version: F.05
dmi.board.name: 30EA
dmi.board.vendor: Quanta
dmi.board.version: 86.09
dmi.chassis.type: 10
dmi.chassis.vendor: Quanta
dmi.chassis.version: N/A
dmi.modalias: dmi:bvnHewlett-Packard:bvrF.05:bd12/07/2007:svnHewlett-Packard:pnCompaqPresarioF700NotebookPC:pvrRev1:rvnQuanta:rn30EA:rvr86.09:cvnQuanta:ct10:cvrN/A:
dmi.product.name: Compaq Presario F700 Notebook PC
dmi.product.version: Rev 1
dmi.sys.vendor: Hewlett-Packard

** Affects: plymouth (Ubuntu)
     Importance: Undecided
         Status: New


** Tags: amd64 apport-package natty unity-2d

-- 
You received this bug notification because you are a member of Ubuntu
Foundations Bugs, which is subscribed to plymouth in Ubuntu.
https://bugs.launchpad.net/bugs/1001835

Title:
  package plymouth-theme-ubuntu-text 0.8.2-2ubuntu23 failed to
  install/upgrade: subprocess installed post-installation script
  returned error exit status 2

Status in “plymouth” package in Ubuntu:
  New

Bug description:
  won't load or update

  ProblemType: Package
  DistroRelease: Ubuntu 11.04
  Package: plymouth-theme-ubuntu-text 0.8.2-2ubuntu23
  ProcVersionSignature: Ubuntu 2.6.38-15.59-generic 2.6.38.8
  Uname: Linux 2.6.38-15-generic x86_64
  NonfreeKernelModules: nvidia
  Architecture: amd64
  Date: Mon May 14 03:39:42 2012
  DefaultPlymouth: /lib/plymouth/themes/satanic-logo/satanic-logo.plymouth
  DpkgTerminalLog:
   Setting up plymouth-theme-ubuntu-text (0.8.2-2ubuntu23) ...
   update-alternatives: error: readlink(/etc/alternatives/text.plymouth) failed: Invalid argument
   dpkg: error processing plymouth-theme-ubuntu-text (--configure):
    subprocess installed post-installation script returned error exit status 2
  ErrorMessage: subprocess installed post-installation script returned error exit status 2
  InstallationMedia: Ubuntu Satanic Edition - amd64 (20110726)
  MachineType: Hewlett-Packard Compaq Presario F700 Notebook PC
  ProcFB:
   
  ProcKernelCmdLine: BOOT_IMAGE=/boot/vmlinuz-2.6.38-15-generic root=UUID=ac726efa-25a0-4046-ad31-2c07507e253b ro single
  SourcePackage: plymouth
  TextPlymouth: Error: command ['readlink', '/etc/alternatives/text.plymouth'] failed with exit code 1:
  Title: package plymouth-theme-ubuntu-text 0.8.2-2ubuntu23 failed to install/upgrade: subprocess installed post-installation script returned error exit status 2
  UpgradeStatus: No upgrade log present (probably fresh install)
  dmi.bios.date: 12/07/2007
  dmi.bios.vendor: Hewlett-Packard
  dmi.bios.version: F.05
  dmi.board.name: 30EA
  dmi.board.vendor: Quanta
  dmi.board.version: 86.09
  dmi.chassis.type: 10
  dmi.chassis.vendor: Quanta
  dmi.chassis.version: N/A
  dmi.modalias: dmi:bvnHewlett-Packard:bvrF.05:bd12/07/2007:svnHewlett-Packard:pnCompaqPresarioF700NotebookPC:pvrRev1:rvnQuanta:rn30EA:rvr86.09:cvnQuanta:ct10:cvrN/A:
  dmi.product.name: Compaq Presario F700 Notebook PC
  dmi.product.version: Rev 1
  dmi.sys.vendor: Hewlett-Packard

To manage notifications about this bug go to:
https://bugs.launchpad.net/ubuntu/+source/plymouth/+bug/1001835/+subscriptions




More information about the foundations-bugs mailing list