[Bug 1001692] [NEW] package vim-runtime 2:7.3.429-2ubuntu2 failed to install/upgrade: subprocess dpkg-deb --control returned error exit status 2

Ahmed Noor Kader Mustajir Md Eusoff 1001692 at bugs.launchpad.net
Sat May 19 16:46:02 UTC 2012


*** This bug is a duplicate of bug 1001697 ***
    https://bugs.launchpad.net/bugs/1001697

Public bug reported:

try tp update the package

ProblemType: Package
DistroRelease: Ubuntu 12.04
Package: vim-runtime 2:7.3.429-2ubuntu2.1
ProcVersionSignature: Ubuntu 3.2.0-24.37-generic 3.2.14
Uname: Linux 3.2.0-24-generic x86_64
ApportVersion: 2.0.1-0ubuntu7
Architecture: amd64
Date: Sun May 20 00:37:58 2012
Dependencies:
 
DuplicateSignature:
 Unpacking replacement openjdk-6-jre-headless ...
 dpkg-deb: error: `/var/cache/apt/archives/vim_2%3a7.3.429-2ubuntu2.1_amd64.deb' is not a debian format archive
 dpkg: error processing /var/cache/apt/archives/vim_2%3a7.3.429-2ubuntu2.1_amd64.deb (--unpack):
  subprocess dpkg-deb --control returned error exit status 2
ErrorMessage: subprocess dpkg-deb --control returned error exit status 2
InstallationMedia: Ubuntu 12.04 LTS "Precise Pangolin" - Release amd64 (20120425)
PackageArchitecture: all
SourcePackage: vim
Title: package vim-runtime 2:7.3.429-2ubuntu2 failed to install/upgrade: subprocess dpkg-deb --control returned error exit status 2
UpgradeStatus: No upgrade log present (probably fresh install)

** Affects: vim (Ubuntu)
     Importance: Undecided
         Status: New


** Tags: amd64 apport-package precise

-- 
You received this bug notification because you are a member of Ubuntu
Foundations Bugs, which is subscribed to vim in Ubuntu.
https://bugs.launchpad.net/bugs/1001692

Title:
  package vim-runtime 2:7.3.429-2ubuntu2 failed to install/upgrade:
  subprocess dpkg-deb --control returned error exit status 2

Status in “vim” package in Ubuntu:
  New

Bug description:
  try tp update the package

  ProblemType: Package
  DistroRelease: Ubuntu 12.04
  Package: vim-runtime 2:7.3.429-2ubuntu2.1
  ProcVersionSignature: Ubuntu 3.2.0-24.37-generic 3.2.14
  Uname: Linux 3.2.0-24-generic x86_64
  ApportVersion: 2.0.1-0ubuntu7
  Architecture: amd64
  Date: Sun May 20 00:37:58 2012
  Dependencies:
   
  DuplicateSignature:
   Unpacking replacement openjdk-6-jre-headless ...
   dpkg-deb: error: `/var/cache/apt/archives/vim_2%3a7.3.429-2ubuntu2.1_amd64.deb' is not a debian format archive
   dpkg: error processing /var/cache/apt/archives/vim_2%3a7.3.429-2ubuntu2.1_amd64.deb (--unpack):
    subprocess dpkg-deb --control returned error exit status 2
  ErrorMessage: subprocess dpkg-deb --control returned error exit status 2
  InstallationMedia: Ubuntu 12.04 LTS "Precise Pangolin" - Release amd64 (20120425)
  PackageArchitecture: all
  SourcePackage: vim
  Title: package vim-runtime 2:7.3.429-2ubuntu2 failed to install/upgrade: subprocess dpkg-deb --control returned error exit status 2
  UpgradeStatus: No upgrade log present (probably fresh install)

To manage notifications about this bug go to:
https://bugs.launchpad.net/ubuntu/+source/vim/+bug/1001692/+subscriptions




More information about the foundations-bugs mailing list