[Bug 1000538] Re: package whoopsie 0.1.32 failed to install/upgrade: subprocess installed post-installation script returned error exit status 1
Gabriel Jimenez
morenopor at hotmail.com
Thu May 17 04:02:20 UTC 2012
--
You received this bug notification because you are a member of Ubuntu
Foundations Bugs, which is subscribed to whoopsie-daisy in Ubuntu.
https://bugs.launchpad.net/bugs/1000538
Title:
package whoopsie 0.1.32 failed to install/upgrade: subprocess
installed post-installation script returned error exit status 1
Status in “whoopsie-daisy” package in Ubuntu:
New
Bug description:
might me located at automatic update packages:
zenity-common_3.4.0-0ubuntu4_all.deb
Full Error Log:
installArchives() failed: (Reading database ...
(Reading database ... 5%%
(Reading database ... 10%%
(Reading database ... 15%%
(Reading database ... 20%%
(Reading database ... 25%%
(Reading database ... 30%%
(Reading database ... 35%%
(Reading database ... 40%%
(Reading database ... 45%%
(Reading database ... 50%%
(Reading database ... 55%%
(Reading database ... 60%%
(Reading database ... 65%%
(Reading database ... 70%%
(Reading database ... 75%%
(Reading database ... 80%%
(Reading database ... 85%%
(Reading database ... 90%%
(Reading database ... 95%%
(Reading database ... 100%%
(Reading database ... 191840 files and directories currently installed.)
Preparing to replace sudo 1.8.3p1-1ubuntu3 (using .../sudo_1.8.3p1-1ubuntu3.2_amd64.deb) ...
Unpacking replacement sudo ...
Preparing to replace zenity 3.4.0-0ubuntu2 (using .../zenity_3.4.0-0ubuntu4_amd64.deb) ...
Unpacking replacement zenity ...
Preparing to replace zenity-common 3.4.0-0ubuntu2 (using .../zenity-common_3.4.0-0ubuntu4_all.deb) ...
Unpacking replacement zenity-common ...
Processing triggers for ureadahead ...
ureadahead will be reprofiled on next reboot
Processing triggers for man-db ...
Setting up whoopsie (0.1.32) ...
groupadd: no se puede bloquear /etc/gshadow; intntelo ms tarde.
adduser: `/usr/sbin/groupadd -g 134 whoopsie' devolvi el cdigo de error 10. Saliendo.
dpkg: error processing whoopsie (--configure):
subprocess installed post-installation script returned error exit status 1
Setting up sudo (1.8.3p1-1ubuntu3.2) ...
Setting up zenity-common (3.4.0-0ubuntu4) ...
Setting up zenity (3.4.0-0ubuntu4) ...
Errors were encountered while processing:
whoopsie
Error in function:
Setting up whoopsie (0.1.32) ...
groupadd: no se puede bloquear /etc/gshadow; intntelo ms tarde.
adduser: `/usr/sbin/groupadd -g 134 whoopsie' devolvi el cdigo de error 10. Saliendo.
dpkg: error processing whoopsie (--configure):
subprocess installed post-installation script returned error exit status 1
ProblemType: Package
DistroRelease: Ubuntu 12.04
Package: whoopsie 0.1.32
ProcVersionSignature: Ubuntu 3.2.0-24.37-generic 3.2.14
Uname: Linux 3.2.0-24-generic x86_64
NonfreeKernelModules: wl
ApportVersion: 2.0.1-0ubuntu7
Architecture: amd64
CrashReports:
600:0:0:297482:2012-05-16 22:54:27.635790000 -0500:2012-05-16 22:54:49.927791131 -0500:/var/crash/whoopsie.0.crash
640:1001:1001:7233213:2012-05-11 08:10:17.793179000 -0500:2012-05-11 08:10:18.793179000 -0500:/var/crash/_usr_lib_chromium-browser_chromium-browser.1001.crash
664:1001:1001:0:2012-05-11 08:10:21.977179403 -0500:2012-05-11 08:10:21.977179403 -0500:/var/crash/_usr_lib_chromium-browser_chromium-browser.1001.upload
640:1001:1001:33945097:2012-05-15 22:07:33.856989000 -0500:2012-05-15 22:07:37.792989257 -0500:/var/crash/_usr_bin_skype.1001.crash
Date: Wed May 16 22:54:28 2012
DuplicateSignature:
Setting up whoopsie (0.1.32) ...
groupadd: no se puede bloquear /etc/gshadow; inténtelo más tarde.
adduser: `/usr/sbin/groupadd -g 134 whoopsie' devolvió el código de error 10. Saliendo.
dpkg: error processing whoopsie (--configure):
subprocess installed post-installation script returned error exit status 1
ErrorMessage: subprocess installed post-installation script returned error exit status 1
InstallationMedia: Ubuntu 11.10 "Oneiric Ocelot" - Release amd64 (20111012)
SourcePackage: whoopsie-daisy
Title: package whoopsie 0.1.32 failed to install/upgrade: subprocess installed post-installation script returned error exit status 1
UpgradeStatus: Upgraded to precise on 2012-04-27 (19 days ago)
To manage notifications about this bug go to:
https://bugs.launchpad.net/ubuntu/+source/whoopsie-daisy/+bug/1000538/+subscriptions
More information about the foundations-bugs
mailing list