[Bug 996486] Re: package libc6-dev 2.13-0ubuntu13.1 failed to install/upgrade: error writing to '<standard output>': No such file or directory
Iqbal Ansari
iqbalansari02 at yahoo.com
Tue May 8 11:29:49 UTC 2012
--
You received this bug notification because you are a member of Ubuntu
Foundations Bugs, which is subscribed to eglibc in Ubuntu.
https://bugs.launchpad.net/bugs/996486
Title:
package libc6-dev 2.13-0ubuntu13.1 failed to install/upgrade: error
writing to '<standard output>': No such file or directory
Status in “eglibc” package in Ubuntu:
New
Bug description:
I upgraded my Ubuntu 11.04 and immediately got a system error
ProblemType: Package
DistroRelease: Ubuntu 11.04
Package: libc6-dev 2.13-0ubuntu13.1
ProcVersionSignature: Ubuntu 2.6.38-8.42-generic 2.6.38.2
Uname: Linux 2.6.38-8-generic x86_64
Architecture: amd64
Date: Tue May 8 16:53:40 2012
ErrorMessage: error writing to '<standard output>': No such file or directory
InstallationMedia: Ubuntu 11.04 "Natty Narwhal" - Release amd64 (20110427.1)
SourcePackage: eglibc
Title: package libc6-dev 2.13-0ubuntu13.1 failed to install/upgrade: error writing to '<standard output>': No such file or directory
UpgradeStatus: No upgrade log present (probably fresh install)
To manage notifications about this bug go to:
https://bugs.launchpad.net/ubuntu/+source/eglibc/+bug/996486/+subscriptions
More information about the foundations-bugs
mailing list