[Bug 995377] [NEW] package python-central 0.6.17ubuntu1 failed to install/upgrade: subprocess dpkg-deb --control returned error exit status 2

Ravindran 995377 at bugs.launchpad.net
Sun May 6 07:16:24 UTC 2012


Public bug reported:

New package was available via apt repository. Trying to install the
package is failing with error.

ProblemType: Package
DistroRelease: Ubuntu 12.04
Package: python-central 0.6.17ubuntu1
ProcVersionSignature: Ubuntu 3.2.0-24.37-generic 3.2.14
Uname: Linux 3.2.0-24-generic x86_64
ApportVersion: 2.0.1-0ubuntu7
AptOrdering:
 python-central: Install
 python-central: Configure
Architecture: amd64
Date: Sun May  6 09:46:06 2012
DpkgTerminalLog:
 dpkg-deb: error: `/var/cache/apt/archives/python-central_0.6.17ubuntu2_all.deb' is not a debian format archive
 dpkg: error processing /var/cache/apt/archives/python-central_0.6.17ubuntu2_all.deb (--unpack):
  subprocess dpkg-deb --control returned error exit status 2
ErrorMessage: subprocess dpkg-deb --control returned error exit status 2
InstallationMedia: Xubuntu 11.04 "Natty Narwhal" - Release amd64 (20110427)
PackageArchitecture: all
SourcePackage: python-central
Title: package python-central 0.6.17ubuntu1 failed to install/upgrade: subprocess dpkg-deb --control returned error exit status 2
UpgradeStatus: Upgraded to precise on 2012-04-01 (34 days ago)

** Affects: python-central (Ubuntu)
     Importance: Undecided
         Status: New


** Tags: amd64 apport-package precise

-- 
You received this bug notification because you are a member of Ubuntu
Foundations Bugs, which is subscribed to python-central in Ubuntu.
https://bugs.launchpad.net/bugs/995377

Title:
  package python-central 0.6.17ubuntu1 failed to install/upgrade:
  subprocess dpkg-deb --control returned error exit status 2

Status in “python-central” package in Ubuntu:
  New

Bug description:
  New package was available via apt repository. Trying to install the
  package is failing with error.

  ProblemType: Package
  DistroRelease: Ubuntu 12.04
  Package: python-central 0.6.17ubuntu1
  ProcVersionSignature: Ubuntu 3.2.0-24.37-generic 3.2.14
  Uname: Linux 3.2.0-24-generic x86_64
  ApportVersion: 2.0.1-0ubuntu7
  AptOrdering:
   python-central: Install
   python-central: Configure
  Architecture: amd64
  Date: Sun May  6 09:46:06 2012
  DpkgTerminalLog:
   dpkg-deb: error: `/var/cache/apt/archives/python-central_0.6.17ubuntu2_all.deb' is not a debian format archive
   dpkg: error processing /var/cache/apt/archives/python-central_0.6.17ubuntu2_all.deb (--unpack):
    subprocess dpkg-deb --control returned error exit status 2
  ErrorMessage: subprocess dpkg-deb --control returned error exit status 2
  InstallationMedia: Xubuntu 11.04 "Natty Narwhal" - Release amd64 (20110427)
  PackageArchitecture: all
  SourcePackage: python-central
  Title: package python-central 0.6.17ubuntu1 failed to install/upgrade: subprocess dpkg-deb --control returned error exit status 2
  UpgradeStatus: Upgraded to precise on 2012-04-01 (34 days ago)

To manage notifications about this bug go to:
https://bugs.launchpad.net/ubuntu/+source/python-central/+bug/995377/+subscriptions




More information about the foundations-bugs mailing list