[Bug 994507] Re: package resolvconf 1.63ubuntu11 failed to install/upgrade: subprocess installed post-installation script returned error exit status 1

yasin keskin yasinkeskin06 at gmail.com
Fri May 4 10:43:13 UTC 2012


** Changed in: resolvconf (Ubuntu)
       Status: New => Incomplete

** Changed in: resolvconf (Ubuntu)
     Assignee: (unassigned) => yasin keskin (yasinkeskin06)

-- 
You received this bug notification because you are a member of Ubuntu
Foundations Bugs, which is subscribed to resolvconf in Ubuntu.
https://bugs.launchpad.net/bugs/994507

Title:
  package resolvconf 1.63ubuntu11 failed to install/upgrade: subprocess
  installed post-installation script returned error exit status 1

Status in “resolvconf” package in Ubuntu:
  Incomplete

Bug description:
  installArchives() failed: Setting up resolvconf (1.63ubuntu11) ...
  ln: `/etc/resolv.conf' silinemedi: leme izin verilmedi
  dpkg: error processing resolvconf (--configure):
   subprocess installed post-installation script returned error exit status 1
  No apport report written because MaxReports is reached already
  dpkg: dependency problems prevent configuration of ubuntu-minimal:
   ubuntu-minimal depends on resolvconf; however:
    Package resolvconf is not configured yet.
  dpkg: error processing ubuntu-minimal (--configure):
   dependency problems - leaving unconfigured
  No apport report written because MaxReports is reached already
  Errors were encountered while processing:
   resolvconf
   ubuntu-minimal
  Error in function: 
  Setting up resolvconf (1.63ubuntu11) ...
  ln: `/etc/resolv.conf' silinemedi: leme izin verilmedi
  dpkg: error processing resolvconf (--configure):
   subprocess installed post-installation script returned error exit status 1
  dpkg: dependency problems prevent configuration of ubuntu-minimal:
   ubuntu-minimal depends on resolvconf; however:
    Package resolvconf is not configured yet.
  dpkg: error processing ubuntu-minimal (--configure):
   dependency problems - leaving unconfigured

  ProblemType: Package
  DistroRelease: Ubuntu 12.04
  Package: resolvconf 1.63ubuntu11
  ProcVersionSignature: Ubuntu 3.2.0-24.38-generic 3.2.16
  Uname: Linux 3.2.0-24-generic x86_64
  NonfreeKernelModules: nvidia
  ApportVersion: 2.0.1-0ubuntu7
  AptOrdering:
   resolvconf: Configure
   ubuntu-minimal: Configure
  Architecture: amd64
  Date: Fri May  4 13:35:53 2012
  DpkgTerminalLog:
   Setting up resolvconf (1.63ubuntu11) ...
   ln: `/etc/resolv.conf' silinemedi: İşleme izin verilmedi
   dpkg: error processing resolvconf (--configure):
    subprocess installed post-installation script returned error exit status 1
  DuplicateSignature:
   Setting up resolvconf (1.63ubuntu11) ...
   ln: `/etc/resolv.conf' silinemedi: İşleme izin verilmedi
   dpkg: error processing resolvconf (--configure):
    subprocess installed post-installation script returned error exit status 1
  ErrorMessage: subprocess installed post-installation script returned error exit status 1
  InstallationMedia: Ubuntu 11.10 "Oneiric Ocelot" - Release amd64 (20111012)
  PackageArchitecture: all
  SourcePackage: resolvconf
  Title: package resolvconf 1.63ubuntu11 failed to install/upgrade: subprocess installed post-installation script returned error exit status 1
  UpgradeStatus: Upgraded to precise on 2012-04-26 (7 days ago)

To manage notifications about this bug go to:
https://bugs.launchpad.net/ubuntu/+source/resolvconf/+bug/994507/+subscriptions




More information about the foundations-bugs mailing list