[Bug 1009330] [NEW] package initramfs-tools 0.99ubuntu13 failed to install/upgrade: subprocess installed post-installation script returned error exit status 1
Carla Sella
1009330 at bugs.launchpad.net
Wed Jun 6 06:22:23 UTC 2012
Public bug reported:
I launched an apt-get update and apt-get upgrade and got an error.
Do not know exactly what caused it.
I launched apt-get clean and again apt-get update and apt-get upgrade, now everything seems fine.
ProblemType: Package
DistroRelease: Ubuntu 12.04
Package: initramfs-tools 0.99ubuntu13
ProcVersionSignature: Ubuntu 3.2.0-24.38-generic 3.2.16
Uname: Linux 3.2.0-24-generic i686
ApportVersion: 2.0.1-0ubuntu8
AptOrdering:
initramfs-tools: Configure
linux-image-3.2.0-24-generic: Configure
Architecture: i386
Date: Wed Jun 6 08:18:23 2012
DpkgTerminalLog:
Setting up initramfs-tools (0.99ubuntu13) ...
cp: not writing through dangling symlink `/etc/initramfs-tools/modules'
dpkg: error processing initramfs-tools (--configure):
subprocess installed post-installation script returned error exit status 1
DuplicateSignature:
Setting up initramfs-tools (0.99ubuntu13) ...
cp: not writing through dangling symlink `/etc/initramfs-tools/modules'
dpkg: error processing initramfs-tools (--configure):
subprocess installed post-installation script returned error exit status 1
ErrorMessage: subprocess installed post-installation script returned error exit status 1
InstallationMedia: Ubuntu 11.04 "Natty Narwhal" - Release i386 (20110427.1)
PackageArchitecture: all
SourcePackage: initramfs-tools
Title: package initramfs-tools 0.99ubuntu13 failed to install/upgrade: subprocess installed post-installation script returned error exit status 1
UpgradeStatus: Upgraded to precise on 2012-04-27 (39 days ago)
** Affects: initramfs-tools (Ubuntu)
Importance: Undecided
Status: New
** Tags: apport-package i386 need-duplicate-check precise
--
You received this bug notification because you are a member of Ubuntu
Foundations Bugs, which is subscribed to initramfs-tools in Ubuntu.
https://bugs.launchpad.net/bugs/1009330
Title:
package initramfs-tools 0.99ubuntu13 failed to install/upgrade:
subprocess installed post-installation script returned error exit
status 1
Status in “initramfs-tools” package in Ubuntu:
New
Bug description:
I launched an apt-get update and apt-get upgrade and got an error.
Do not know exactly what caused it.
I launched apt-get clean and again apt-get update and apt-get upgrade, now everything seems fine.
ProblemType: Package
DistroRelease: Ubuntu 12.04
Package: initramfs-tools 0.99ubuntu13
ProcVersionSignature: Ubuntu 3.2.0-24.38-generic 3.2.16
Uname: Linux 3.2.0-24-generic i686
ApportVersion: 2.0.1-0ubuntu8
AptOrdering:
initramfs-tools: Configure
linux-image-3.2.0-24-generic: Configure
Architecture: i386
Date: Wed Jun 6 08:18:23 2012
DpkgTerminalLog:
Setting up initramfs-tools (0.99ubuntu13) ...
cp: not writing through dangling symlink `/etc/initramfs-tools/modules'
dpkg: error processing initramfs-tools (--configure):
subprocess installed post-installation script returned error exit status 1
DuplicateSignature:
Setting up initramfs-tools (0.99ubuntu13) ...
cp: not writing through dangling symlink `/etc/initramfs-tools/modules'
dpkg: error processing initramfs-tools (--configure):
subprocess installed post-installation script returned error exit status 1
ErrorMessage: subprocess installed post-installation script returned error exit status 1
InstallationMedia: Ubuntu 11.04 "Natty Narwhal" - Release i386 (20110427.1)
PackageArchitecture: all
SourcePackage: initramfs-tools
Title: package initramfs-tools 0.99ubuntu13 failed to install/upgrade: subprocess installed post-installation script returned error exit status 1
UpgradeStatus: Upgraded to precise on 2012-04-27 (39 days ago)
To manage notifications about this bug go to:
https://bugs.launchpad.net/ubuntu/+source/initramfs-tools/+bug/1009330/+subscriptions
More information about the foundations-bugs
mailing list