[Bug 1036050] Re: package initscripts 2.88dsf-13.10ubuntu11.1 failed to install/upgrade: ErrorMessage: Unterprozess installiertes post-installation-Skript gab den Fehlerwert 1 zurück

Bruno Schneider dl7un at online.de
Mon Aug 13 06:23:01 UTC 2012


-- 
You received this bug notification because you are a member of Ubuntu
Foundations Bugs, which is subscribed to sysvinit in Ubuntu.
https://bugs.launchpad.net/bugs/1036050

Title:
  package initscripts 2.88dsf-13.10ubuntu11.1 failed to install/upgrade:
  ErrorMessage: Unterprozess installiertes post-installation-Skript gab
  den Fehlerwert 1 zurück

Status in “sysvinit” package in Ubuntu:
  New

Bug description:
  installArchives() failed: 
  Extrahiere Vorlagen aus Paketen: 50%%
  Extrahiere Vorlagen aus Paketen: 100%%
  Vorkonfiguration der Pakete ...

  Extrahiere Vorlagen aus Paketen: 50%%
  Extrahiere Vorlagen aus Paketen: 100%%
  Vorkonfiguration der Pakete ...

  Extrahiere Vorlagen aus Paketen: 50%%
  Extrahiere Vorlagen aus Paketen: 100%%
  Vorkonfiguration der Pakete ...

  Extrahiere Vorlagen aus Paketen: 50%%
  Extrahiere Vorlagen aus Paketen: 100%%
  Vorkonfiguration der Pakete ...
  Setting up initscripts (2.88dsf-13.10ubuntu11.1) ...
  update-rc.d: /etc/init.d/urandom: file does not exist
  dpkg: error processing initscripts (--configure):
   subprocess installed post-installation script returned error exit status 1
  Error in function: 
  Setting up initscripts (2.88dsf-13.10ubuntu11.1) ...
  update-rc.d: /etc/init.d/urandom: file does not exist
  dpkg: error processing initscripts (--configure):
   subprocess installed post-installation script returned error exit status 1
  dpkg: dependency problems prevent configuration of resolvconf:
   resolvconf depends on initscripts (>= 2.88dsf-13.10); however:
    Package initscripts is not configured yet.
  dpkg: error processing resolvconf (--configure):
   dependency problems - leaving unconfigured

  ProblemType: Package
  DistroRelease: Ubuntu 12.04
  Package: initscripts 2.88dsf-13.10ubuntu11.1
  ProcVersionSignature: Ubuntu 3.2.0-27.43-generic 3.2.21
  Uname: Linux 3.2.0-27-generic x86_64
  NonfreeKernelModules: nvidia
  ApportVersion: 2.0.1-0ubuntu11
  Architecture: amd64
  Date: Sat Aug 11 09:38:12 2012
  ErrorMessage: ErrorMessage: Unterprozess installiertes post-installation-Skript gab den Fehlerwert 1 zurück
  InstallationMedia: Ubuntu 11.04 "Natty Narwhal" - Release amd64 (20110427)
  SourcePackage: sysvinit
  Title: package initscripts 2.88dsf-13.10ubuntu11.1 failed to install/upgrade: ErrorMessage: Unterprozess installiertes post-installation-Skript gab den Fehlerwert 1 zurück
  UpgradeStatus: No upgrade log present (probably fresh install)

To manage notifications about this bug go to:
https://bugs.launchpad.net/ubuntu/+source/sysvinit/+bug/1036050/+subscriptions




More information about the foundations-bugs mailing list