[Bug 838795] [NEW] openssl 1.0.0d-2ubuntu2 fails to build on i386
Phil Norbeck
ptn107 at gmail.com
Thu Sep 1 13:06:21 UTC 2011
Public bug reported:
Ubuntu 10.04.3 LTS
openssl 1.0.0d-2ubuntu2
The amd64 builds fine but the i386 does not with this error:
dpkg-gensymbols -Pdebian/libssl1.0.0/ -plibssl1.0.0 -c4
dpkg-gensymbols: warning: some libraries disappeared in the symbols file: libssl.so.1.0.0 libcrypto.so.1.0.0
Use of uninitialized value $_[0] in sprintf at /usr/share/perl5/Dpkg/ErrorHandling.pm line 48.
dpkg-gensymbols: warning: doesn't match completely debian/libssl1.0.0.symbols
--- debian/libssl1.0.0.symbols (libssl1.0.0_1.0.0d-2ubuntu2~lucid1_i386)
+++ dpkg-gensymbolsrKxPIA 2011-09-01 12:19:08.000000000 +0000
@@ -1,4 +0,0 @@
-libcrypto.so.1.0.0 libssl1.0.0 #MINVER#
- (symver|optional)OPENSSL_1.0.0 1.0.0
-libssl.so.1.0.0 libssl1.0.0 #MINVER#
- (symver|optional)OPENSSL_1.0.0 1.0.0
make: *** [binary-arch] Error 3
dpkg-buildpackage: error: /usr/bin/fakeroot debian/rules binary gave error exit status 2
Dependencies were satisfied. Full build log is attached.
** Affects: openssl (Ubuntu)
Importance: Undecided
Status: New
--
You received this bug notification because you are a member of Ubuntu
Foundations Bugs, which is subscribed to openssl in Ubuntu.
https://bugs.launchpad.net/bugs/838795
Title:
openssl 1.0.0d-2ubuntu2 fails to build on i386
Status in “openssl” package in Ubuntu:
New
Bug description:
Ubuntu 10.04.3 LTS
openssl 1.0.0d-2ubuntu2
The amd64 builds fine but the i386 does not with this error:
dpkg-gensymbols -Pdebian/libssl1.0.0/ -plibssl1.0.0 -c4
dpkg-gensymbols: warning: some libraries disappeared in the symbols file: libssl.so.1.0.0 libcrypto.so.1.0.0
Use of uninitialized value $_[0] in sprintf at /usr/share/perl5/Dpkg/ErrorHandling.pm line 48.
dpkg-gensymbols: warning: doesn't match completely debian/libssl1.0.0.symbols
--- debian/libssl1.0.0.symbols (libssl1.0.0_1.0.0d-2ubuntu2~lucid1_i386)
+++ dpkg-gensymbolsrKxPIA 2011-09-01 12:19:08.000000000 +0000
@@ -1,4 +0,0 @@
-libcrypto.so.1.0.0 libssl1.0.0 #MINVER#
- (symver|optional)OPENSSL_1.0.0 1.0.0
-libssl.so.1.0.0 libssl1.0.0 #MINVER#
- (symver|optional)OPENSSL_1.0.0 1.0.0
make: *** [binary-arch] Error 3
dpkg-buildpackage: error: /usr/bin/fakeroot debian/rules binary gave error exit status 2
Dependencies were satisfied. Full build log is attached.
To manage notifications about this bug go to:
https://bugs.launchpad.net/ubuntu/+source/openssl/+bug/838795/+subscriptions
More information about the foundations-bugs
mailing list