[Bug 885280] Re: internal compiler error: in add_phi_arg, at tree-phinodes.c:391 [maverick]
Cafuego
ubuntu at cafuego.net
Tue Nov 15 22:10:56 UTC 2011
... as per
https://launchpad.net/~cafuego/+archive/inkscape/+build/2926134/+files
/buildlog_ubuntu-
lucid-i386.inkscape_0.49~devel%2B10740%2B6~lucid1_FAILEDTOBUILD.txt.gz
--
You received this bug notification because you are a member of Ubuntu
Foundations Bugs, which is subscribed to gcc-4.4 in Ubuntu.
https://bugs.launchpad.net/bugs/885280
Title:
internal compiler error: in add_phi_arg, at tree-phinodes.c:391
[maverick]
Status in The GNU Compiler Collection:
Unknown
Status in Inkscape: A Vector Drawing Tool:
Triaged
Status in “gcc-4.4” package in Ubuntu:
Confirmed
Bug description:
Inkscape daily builds for maverick [1] are failing with this gcc
internal error.
CXX display/nr-filter-specularlighting.o
display/nr-filter-slot.cpp: In constructor 'Inkscape::Filters::FilterSlot::FilterSlot(Inkscape::DrawingItem*, Inkscape::DrawingContext*, Inkscape::DrawingContext&, const Inkscape::Filters::FilterUnits&)':
display/nr-filter-slot.cpp:38: internal compiler error: in add_phi_arg, at tree-phinodes.c:391
Please submit a full bug report,
with preprocessed source if appropriate.
See <file:///usr/share/doc/gcc-4.4/README.Bugs> for instructions.
make[4]: *** [display/nr-filter-slot.o] Error 1
[1] https://launchpadlibrarian.net/84246305/buildlog_ubuntu-
maverick-i386.inkscape_1%3A0.48%2Bdevel%2B10710%2B24%7Emaverick1_FAILEDTOBUILD.txt.gz
The issue is not present on natty or newer builds. It is a known
upstream issue (http://gcc.gnu.org/bugzilla/show_bug.cgi?id=45709).
Fix was committed as
http://gcc.gnu.org/viewcvs?view=revision&revision=164400
To manage notifications about this bug go to:
https://bugs.launchpad.net/gcc/+bug/885280/+subscriptions
More information about the foundations-bugs
mailing list