[Bug 642762] Re: package libpython2.6 2.6.6-5ubuntu1 failed to install/upgrade: error escribiendo en «<salida estándar>»: Éxito
Matthias Klose
doko at ubuntu.com
Sat May 28 11:40:01 UTC 2011
thanks for checking. closing the report.
** Changed in: python2.6 (Ubuntu)
Status: Incomplete => Invalid
--
You received this bug notification because you are a member of Ubuntu
Foundations Bugs, which is subscribed to python2.6 in Ubuntu.
https://bugs.launchpad.net/bugs/642762
Title:
package libpython2.6 2.6.6-5ubuntu1 failed to install/upgrade: error
escribiendo en «<salida estándar>»: Éxito
Status in “python2.6” package in Ubuntu:
Invalid
Bug description:
Binary package hint: python2.6
This happend when i launch a apt-get update && apt-get upgrade.
Ubuntu 10.10 Maverick (18-09-2010 to 19-09-2010)
package libpython2.6 2.6.6-5ubuntu1
I expected a upgrade.
And instead final in error.
ProblemType: Package
DistroRelease: Ubuntu 10.10
Package: libpython2.6 2.6.6-5ubuntu1
ProcVersionSignature: Ubuntu 2.6.35-19.28-generic 2.6.35.3
Uname: Linux 2.6.35-19-generic x86_64
NonfreeKernelModules: nvidia
Architecture: amd64
Date: Sun Sep 19 00:37:25 2010
ErrorMessage: error escribiendo en «<salida estándar>»: Éxito
InstallationMedia: Ubuntu 10.04 "Lucid Lynx" - Beta amd64 (20100406.1)
SourcePackage: python2.6
Title: package libpython2.6 2.6.6-5ubuntu1 failed to install/upgrade: error escribiendo en «<salida estándar>»: Éxito
More information about the foundations-bugs
mailing list