[Bug 797462] [NEW] package samba-common-bin 2:3.5.8~dfsg-1ubuntu2.2 failed to install/upgrade: subprocess installed post-installation script returned error exit status 2
bill mang
797462 at bugs.launchpad.net
Wed Jun 15 00:11:06 UTC 2011
Public bug reported:
Binary package hint: samba
Setting up samba-common-bin (2:3.5.8~dfsg-1ubuntu2.2) ...
update-alternatives: error: /var/lib/dpkg/alternatives/nmblookup corrupt: line not terminated while trying to read status
dpkg: error processing samba-common-bin (--configure):
subprocess installed post-installation script returned error exit status 2
E: Sub-process /usr/bin/dpkg returned an error code (1)
ProblemType: Package
DistroRelease: Ubuntu 11.04
Package: samba-common-bin 2:3.5.8~dfsg-1ubuntu2.2
ProcVersionSignature: Ubuntu 2.6.38-8.42-generic 2.6.38.2
Uname: Linux 2.6.38-8-generic i686
NonfreeKernelModules: wl
AptOrdering:
samba-common-bin: Configure
samba: Configure
Architecture: i386
Date: Tue Jun 14 20:03:09 2011
DpkgTerminalLog:
Setting up samba-common-bin (2:3.5.8~dfsg-1ubuntu2.2) ...
update-alternatives: error: /var/lib/dpkg/alternatives/nmblookup corrupt: line not terminated while trying to read status
dpkg: error processing samba-common-bin (--configure):
subprocess installed post-installation script returned error exit status 2
ErrorMessage: subprocess installed post-installation script returned error exit status 2
InstallationMedia: Ubuntu 10.10 "Maverick Meerkat" - Release i386 (20101007)
RelatedPackageVersions:
nautilus 1:2.32.2.1-0ubuntu13
gvfs 1.8.0-0ubuntu2
SambaClientRegression: Yes
SourcePackage: samba
Title: package samba-common-bin 2:3.5.8~dfsg-1ubuntu2.2 failed to install/upgrade: subprocess installed post-installation script returned error exit status 2
UpgradeStatus: Upgraded to natty on 2011-05-03 (43 days ago)
** Affects: samba (Ubuntu)
Importance: Undecided
Status: New
** Tags: apport-package i386 natty
--
You received this bug notification because you are a member of Ubuntu
Foundations Bugs, which is subscribed to samba in Ubuntu.
https://bugs.launchpad.net/bugs/797462
Title:
package samba-common-bin 2:3.5.8~dfsg-1ubuntu2.2 failed to
install/upgrade: subprocess installed post-installation script
returned error exit status 2
Status in “samba” package in Ubuntu:
New
Bug description:
Binary package hint: samba
Setting up samba-common-bin (2:3.5.8~dfsg-1ubuntu2.2) ...
update-alternatives: error: /var/lib/dpkg/alternatives/nmblookup corrupt: line not terminated while trying to read status
dpkg: error processing samba-common-bin (--configure):
subprocess installed post-installation script returned error exit status 2
E: Sub-process /usr/bin/dpkg returned an error code (1)
ProblemType: Package
DistroRelease: Ubuntu 11.04
Package: samba-common-bin 2:3.5.8~dfsg-1ubuntu2.2
ProcVersionSignature: Ubuntu 2.6.38-8.42-generic 2.6.38.2
Uname: Linux 2.6.38-8-generic i686
NonfreeKernelModules: wl
AptOrdering:
samba-common-bin: Configure
samba: Configure
Architecture: i386
Date: Tue Jun 14 20:03:09 2011
DpkgTerminalLog:
Setting up samba-common-bin (2:3.5.8~dfsg-1ubuntu2.2) ...
update-alternatives: error: /var/lib/dpkg/alternatives/nmblookup corrupt: line not terminated while trying to read status
dpkg: error processing samba-common-bin (--configure):
subprocess installed post-installation script returned error exit status 2
ErrorMessage: subprocess installed post-installation script returned error exit status 2
InstallationMedia: Ubuntu 10.10 "Maverick Meerkat" - Release i386 (20101007)
RelatedPackageVersions:
nautilus 1:2.32.2.1-0ubuntu13
gvfs 1.8.0-0ubuntu2
SambaClientRegression: Yes
SourcePackage: samba
Title: package samba-common-bin 2:3.5.8~dfsg-1ubuntu2.2 failed to install/upgrade: subprocess installed post-installation script returned error exit status 2
UpgradeStatus: Upgraded to natty on 2011-05-03 (43 days ago)
To manage notifications about this bug go to:
https://bugs.launchpad.net/ubuntu/+source/samba/+bug/797462/+subscriptions
More information about the foundations-bugs
mailing list