[Bug 791315] Re: libnih version 1.0.3-4ubuntu1 failed to build on armel

Dr. David Alan Gilbert 791315 at bugs.launchpad.net
Wed Jun 8 16:59:40 UTC 2011


make[3]: Entering directory `/build/buildd/libnih-1.0.3/nih'
/bin/bash: line 5: 24330 Segmentation fault      ${dir}$tst
FAIL: test_alloc
/bin/bash: line 5: 24335 Segmentation fault      ${dir}$tst
FAIL: test_string
/bin/bash: line 5: 24340 Segmentation fault      ${dir}$tst
FAIL: test_list
/bin/bash: line 5: 24345 Segmentation fault      ${dir}$tst
FAIL: test_hash
/bin/bash: line 5: 24350 Segmentation fault      ${dir}$tst
FAIL: test_tree
/bin/bash: line 5: 24355 Segmentation fault      ${dir}$tst
FAIL: test_timer
/bin/bash: line 5: 24360 Segmentation fault      ${dir}$tst
FAIL: test_signal
/bin/bash: line 5: 24365 Segmentation fault      ${dir}$tst
FAIL: test_child
/bin/bash: line 5: 24370 Segmentation fault      ${dir}$tst
FAIL: test_io
/bin/bash: line 5: 24375 Segmentation fault      ${dir}$tst
FAIL: test_file

-- 
You received this bug notification because you are a member of Ubuntu
Foundations Bugs, which is subscribed to libnih in Ubuntu.
https://bugs.launchpad.net/bugs/791315

Title:
  libnih version 1.0.3-4ubuntu1 failed to build on armel

Status in “libnih” package in Ubuntu:
  New

Bug description:
  libnih version 1.0.3-4ubuntu1 failed to build on armel
  Link to failed build: https://launchpad.net/ubuntu/+source/libnih/1.0.3-4ubuntu1/+build/2523639

  Direct link to the build log:
  https://launchpad.net/ubuntu/+source/libnih/1.0.3-4ubuntu1/+build/2523639/+files
  /buildlog_ubuntu-oneiric-
  armel.libnih_1.0.3-4ubuntu1_FAILEDTOBUILD.txt.gz

  This log snippet might be of interest, since it triggered the matcher 'Purging chroot-autobuild'.
  Excerpt 996 lines into the build log:

  ...with unhandled error beneath context
  PASS: test_error
  ==================================================
  14 of 17 tests failed
  Please report to http://bugs.launchpad.net/libnih/
  ==================================================
  make[3]: *** [check-TESTS] Error 1
  make[3]: Leaving directory `/build/buildd/libnih-1.0.3/nih'
  make[2]: *** [check-am] Error 2
  make[2]: Leaving directory `/build/buildd/libnih-1.0.3/nih'
  make[1]: *** [check-recursive] Error 1
  make[1]: Leaving directory `/build/buildd/libnih-1.0.3'
  dh_auto_test: make -j1 check returned exit code 2
  make: *** [build] Error 29
  dpkg-buildpackage: error: debian/rules build gave error exit status 2
  ******************************************************************************
  Build finished at 20110601-0429
  FAILED [dpkg-buildpackage died]
  Purging chroot-autobuild/build/buildd/libnih-1.0.3




More information about the foundations-bugs mailing list