[Bug 628859] Re: package grub-pc 1.98-1ubuntu7 failed to install/upgrade: ErrorMessage: subprocess installed post-installation script returned error exit status 2
Brian Murray
brian at ubuntu.com
Fri Jul 22 18:30:27 UTC 2011
** Tags added: dist-upgrade
--
You received this bug notification because you are a member of Ubuntu
Foundations Bugs, which is subscribed to grub2 in Ubuntu.
https://bugs.launchpad.net/bugs/628859
Title:
package grub-pc 1.98-1ubuntu7 failed to install/upgrade: ErrorMessage:
subprocess installed post-installation script returned error exit
status 2
Status in “grub2” package in Ubuntu:
New
Bug description:
Binary package hint: grub2
update-initramfs: Generating /boot/initrd.img-2.6.32-24-generic
Running postinst hook script /usr/sbin/update-grub.
Generating grub.cfg ...
/etc/grub.d/05_debian_theme: line 58: unexpected EOF while looking for matching `"'
User postinst hook script [/usr/sbin/update-grub] exited with value 2
dpkg: error processing linux-image-2.6.32-24-generic (--configure):
subprocess installed post-installation script returned error exit status 2
Setting up grub-pc (1.98-1ubuntu7) ...
Installation finished. No error reported.
Generating grub.cfg ...
/etc/grub.d/05_debian_theme: line 58: unexpected EOF while looking for matching `"'
dpkg: error processing grub-pc (--configure):
subprocess installed post-installation script returned error exit status 2
dpkg: dependency problems prevent configuration of linux-image-generic:
linux-image-generic depends on linux-image-2.6.32-24-generic; however:
Package linux-image-2.6.32-24-generic is not configured yet.
dpkg: error processing linux-image-generic (--configure):
dependency problems - leaving unconfigured
dpkg: dependency problems prevent configuration of linux-generic:
linux-generic depends on linux-image-generic (= 2.6.32.24.25); however:
Package linux-image-generic is not configured yet.
dpkg: error processing linux-generic (--configure):
dependency problems - leaving unconfigured
ProblemType: Package
DistroRelease: Ubuntu 10.04
Package: grub-pc 1.98-1ubuntu7
ProcVersionSignature: Ubuntu 2.6.32-21.32-generic 2.6.32.11+drm33.2
Uname: Linux 2.6.32-21-generic i686
Architecture: i386
Date: Thu Sep 2 14:38:05 2010
ErrorMessage: ErrorMessage: subprocess installed post-installation script returned error exit status 2
SourcePackage: grub2
Title: package grub-pc 1.98-1ubuntu7 failed to install/upgrade: ErrorMessage: subprocess installed post-installation script returned error exit status 2
To manage notifications about this bug go to:
https://bugs.launchpad.net/ubuntu/+source/grub2/+bug/628859/+subscriptions
More information about the foundations-bugs
mailing list