[Bug 580138] Re: package grub-common 1.97~beta4-1ubuntu4.1 failed to install/upgrade:

Brian Murray brian at ubuntu.com
Wed Jul 20 17:30:44 UTC 2011


*** This bug is a duplicate of bug 541595 ***
    https://bugs.launchpad.net/bugs/541595

** This bug is no longer a duplicate of bug 580134
   package libquicktime1 2:1.1.1 debian-1build1 failed to install/upgrade:
** This bug has been marked a duplicate of bug 541595
   [Master] package failed to install/upgrade: package is already installed and configured

-- 
You received this bug notification because you are a member of Ubuntu
Foundations Bugs, which is subscribed to dpkg in Ubuntu.
https://bugs.launchpad.net/bugs/580138

Title:
  package grub-common 1.97~beta4-1ubuntu4.1 failed to install/upgrade:

Status in “dpkg” package in Ubuntu:
  New

Bug description:
  Binary package hint: dpkg


  Do any of the following bugs describe the bug you're trying to report?

      *
        		
        #159976 mysql-common_5.0.45-1ubuntu3_all.deb fails to upgrade
        Invalid (3 comments) last updated 2007-11-23 view this bug

        Binary package hint: mysql-common

        After performing an upgrade from Feisty to Gutsy, the update
  manager tells me following packages need updating:

        1) mysql-common (from version: 5.0.30_ubuntu1.1 to version: 5.0.45_ubuntu3)
        2) mysql-server-5.0 (from version: 5.0.30_ubuntu1.1 to version: 5.0.45_ubuntu3)

        when I choose "install updates", update manager shows the following error message:
        E: /var/cache/apt/archives/mysql-common_5.0.45-1ubuntu3_all.deb: unable to install (supposed) new info file `...
        		
        	
        I am affected by this bug

        #159976 "mysql-common_5.0.45-1ubuntu3_all.de..."

        Just mark the bug as affecting me

        Subscribe me as well
        OKCancel
        	
        		
      *
        		
        #575520 package libdevkit-power-gobject1 1:0.9.1-1 failed to install/upgrade:
        Incomplete (2 comments) last updated 2010-05-05 view this bug

        Binary package hint: dpkg

        error as part of upgrade

        ProblemType: Package
        DistroRelease: Ubuntu 10.04
        Package: libdevkit-power-gobject1 1:0.9.1-1
        ProcVersionSignature: Ubuntu 2.6.32-21.32-generic 2.6.32.11+drm33.2
        Uname: Linux 2.6.32-21-generic i686
        Architecture: i386
        Date: Tue May 4 18:03:03 2010
        ErrorMessage:
         ErrorMessage: package libdevkit-power-gobject1 is already installed and configured
        InstallationMedia: Ubuntu 9.10 "Karmic Koala" - Release i386 (20091028.5)
        SourcePackage: dpkg
        Title...
        		
        	
        I am affected by this bug

        #575520 "package libdevkit-power-gobject1 1:..."

        Just mark the bug as affecting me

        Subscribe me as well
        OKCancel
        	
        		
      *
        		
        #492767 package grub-pc 1.97~beta4-1ubuntu4 failed to install/upgrade: Unterprozess installiertes post-installation-Skript gab den Fehlerwert 1 zurück; I'm very sorry to tell you, that your "Aktualisierungsverwaltung" wanted to install "grub-pc" without my agreement. I put away the "agree-button" but the packed, however, was downloaded. Please fix this bug!
        Invalid (2 comments) last updated 2010-01-24 view this bug

        Binary package hint: grub2

        I'm very sorry to tell you, that your
  "Aktualisierungsverwaltung" wanted to install "grub-pc" without my
  agreement. I put away the "agree-button" but the packed, however, was
  downloaded. Please fix this bug!

        Ubuntu 9.10; I removed "grub" a month before, because a have got
  a second Ubuntu installed.

        ProblemType: Package
        Architecture: i386
        Date: Sat Dec 5 09:25:35 2009
        DistroRelease: Ubuntu 9.10
        ErrorMessage: Unterprozess installiertes post-installation-Skript gab...
        		
        	
        I am affected by this bug

        #492767 "package grub-pc 1.97~beta4-1ubuntu4..."

        Just mark the bug as affecting me

        Subscribe me as well
        OKCancel
        	
        		
      *
        		
        #369282 gnome-games gives an error while upgrading
        Invalid (4 comments) last updated 2009-05-03 view this bug

        Binary package hint: gnome-games

        While upgrading apt-get gives this error:

        -------------------------------- apt-get ------------------------------------
        root at my-desktop:~# apt-get check
        Reading package lists... Done
        Building dependency tree
        Reading state information... Done
        You might want to run `apt-get -f install' to correct these.
        The following packages have unmet dependencies:
          gnome-games: Depends: gnome-games-data (< 1:2.25) but 1:2.26.1-0ubuntu2 is installed
        E: Unmet dependen...
        		
        	
        I am affected by this bug

        #369282 "gnome-games gives an error while up..."

        Just mark the bug as affecting me

        Subscribe me as well
        OKCancel
        	
        		
      *
        		
        #374361 package libgweather-common 2.26.1-0ubuntu2 failed to install/upgrade: package libgweather-common is already installed and configured
        New (2 comments) last updated 2009-11-13 view this bug

        I upgraded the new packages in ubuntu 9.04 and then this
  application reported a crash. Please do look into this issue.

        ProblemType: Package
        Architecture: i386
        DistroRelease: Ubuntu 9.04
        ErrorMessage: package libgweather-common is already installed and configured
        Package: libgweather-common 2.26.1-0ubuntu2
        PackageArchitecture: all
        SourcePackage: libgweather
        Title: package libgweather-common 2.26.1-0ubuntu2 failed to install/upgrade: package libgweather-common is already installed and configur...
        		
        	
        I am affected by this bug

        #374361 "package libgweather-common 2.26.1-0..."

        Just mark the bug as affecting me

        Subscribe me as well
        OKCancel
        	
        		
      *
        		
        #397498 dpkg 1.15.3.1ubuntu1 fails to install/upgrade
        Fix Released (28 comments) last updated 2010-02-08 view this bug

        Binary package hint: dpkg

        When I try to run an upgrade, this error occurs:

        Preparing to replace dpkg 1.14.24ubuntu2 (using .../dpkg_1.15.3.1ubuntu1_i386.deb) ...
        dpkg: error processing /var/cache/apt/archives/dpkg_1.15.3.1ubuntu1_i386.deb (--unpack):
         subprocess pre-installation script returned error exit status 1
        Errors were encountered while processing:
         /var/cache/apt/archives/dpkg_1.15.3.1ubuntu1_i386.deb

        I have tried running the upgrade from every frontend to apt that I could think of...
        		
        	
        I am affected by this bug

        #397498 "dpkg 1.15.3.1ubuntu1 fails to insta..."

        Just mark the bug as affecting me

        Subscribe me as well
        OKCancel
        	
        		
      *
        		
        #463201 package dpkg 1.15.4ubuntu2 failed to install/upgrade: subprocess installed post-installation script returned error exit status 1
        Invalid (10 comments) last updated 2010-02-09 view this bug

        Binary package hint: dpkg

        Upgrading from Ubuntu Jaunty server to final RC for Karmic. Did
  not see the error. I'm just taking the default options here to get
  thru this bug report. Seemingly dpkg won't upgrade??? This is a std
  upgrade on a vanilla Jaunty following the server upgrade instructions.

        ProblemType: Package
        Architecture: i386
        DistroRelease: Ubuntu 9.10
        ErrorMessage: subprocess installed post-installation script returned error exit status 1
        Package: dpkg 1.15.4ubuntu2
        SourcePacka...
        		
        	
        I am affected by this bug

        #463201 "package dpkg 1.15.4ubuntu2 failed t..."

        Just mark the bug as affecting me

        Subscribe me as well
        OKCancel
        	
        		
      *
        		
        #237333 error during upgrade packages dpkg
        Invalid (3 comments) last updated 2009-11-10 view this bug

        Release Ubuntu 8.04 Hardy Heron (italian language)

        During normal application updates,
        system begins to give errors

        With EVERY packages,

        this is my translation from italian of the message error
  appeared:

        dpkg-deb: impossible create a directory: no file or directory
        dpkg: error processing /var/cache/apt/archives/NAMEOFEVERYPACKAGE.deb (--unpack):
        subprocess dpkg-deb --control returned error exit status 2

        E: Sub-process /usr/bin/dpkg returned an error code (1)
        Installation of a package fail...
        		
        	
        I am affected by this bug

        #237333 "error during upgrade packages dpkg"

        Just mark the bug as affecting me

        Subscribe me as well
        OKCancel
        	
        		
      *
        		
        #349469 debconf: DbDriver "config": /var/cache/debconf/config.dat is locked by another process: Resource temporarily unavailable
        Open (7 comments) last updated 2010-04-09 view this bug

        Binary package hint: cups

        Crash detection report attached.

        ProblemType: Package
        Architecture: i386
        DistroRelease: Ubuntu 8.10
        ErrorMessage: subprocess post-installation script returned error exit status 1
        NonfreeKernelModules: nvidia
        Package: cups 1.3.9-2ubuntu8
        SourcePackage: cups
        Title: package cups 1.3.9-2ubuntu8 failed to install/upgrade: subprocess post-installation script returned error exit status 1
        Uname: Linux 2.6.27-11-generic i686
        		
        	
        I am affected by this bug

        #349469 "debconf: DbDriver "config": /var/ca..."

        Just mark the bug as affecting me

        Subscribe me as well
        OKCancel
        	
        		
      *
        		
        #512096 [MASTER] Exec format error : package failed to install/remove : installation/removal script returned error exit status 2
        Triaged (16 comments) last updated 2010-05-12 view this bug

        Under some conditions package installation/upgrade/removal fails
  with the following error:

        -- Error during installation --
        Setting up screenlets (0.1.2-7) ...
        dpkg (subprocess): unable to execute installed post-installation script: Exec format error
        dpkg: error processing screenlets (--configure):
         subprocess installed post-installation script returned error exit status 2

        -- Error during removal --
        Removing gnome-do ...
        dpkg (subprocess): unable to execute installed pre-removal script: Exec...
        		
        	
        I am affected by this bug

        #512096 "[MASTER] Exec format error : packag..."

        Just mark the bug as affecting me

        Subscribe me as well
        OKCancel

  ProblemType: Package
  DistroRelease: Ubuntu 10.04
  Package: grub-common 1.97~beta4-1ubuntu4.1
  ProcVersionSignature: Ubuntu 2.6.32-22.33-generic 2.6.32.11+drm33.2
  Uname: Linux 2.6.32-22-generic i686
  NonfreeKernelModules: nvidia
  Architecture: i386
  Date: Thu May 13 04:01:39 2010
  ErrorMessage:
   ErrorMessage: package grub-common is already installed and configured
  SourcePackage: dpkg
  Title: package grub-common 1.97~beta4-1ubuntu4.1 failed to install/upgrade:

To manage notifications about this bug go to:
https://bugs.launchpad.net/ubuntu/+source/dpkg/+bug/580138/+subscriptions




More information about the foundations-bugs mailing list