[Bug 773959] Re: package memtest86+ 4.10-1.1ubuntu1 failed to install/upgrade: ErrorMessage: subprocess installed post-installation script returned error exit status 1
Brian Murray
brian at ubuntu.com
Fri Jul 15 16:41:14 UTC 2011
>From VarLogDistuupgradeApttermlog.gz:
Setting up memtest86+ (4.10-1.1ubuntu1) ...^M
Generating grub.cfg ...^M
/usr/sbin/grub-probe: error: not a directory.^M
dpkg: error processing memtest86+ (--configure):^M
subprocess installed post-installation script returned error exit status 1^M
This indicates an error with grub2 and not memtest.
** Package changed: memtest86+ (Ubuntu) => grub2 (Ubuntu)
** Changed in: grub2 (Ubuntu)
Status: New => Confirmed
** Changed in: grub2 (Ubuntu)
Importance: Undecided => Medium
** Summary changed:
- package memtest86+ 4.10-1.1ubuntu1 failed to install/upgrade: ErrorMessage: subprocess installed post-installation script returned error exit status 1
+ grub-probe: error: not a directory
--
You received this bug notification because you are a member of Ubuntu
Foundations Bugs, which is subscribed to memtest86+ in Ubuntu.
https://bugs.launchpad.net/bugs/773959
Title:
grub-probe: error: not a directory
Status in “grub2” package in Ubuntu:
Confirmed
Bug description:
Binary package hint: memtest86+
Failed to upgrade when performing natty upgrade
ProblemType: Package
DistroRelease: Ubuntu 11.04
Package: memtest86+ 4.10-1.1ubuntu1
ProcVersionSignature: Ubuntu 2.6.35-29.51-generic 2.6.35.12
Uname: Linux 2.6.35-29-generic i686
Architecture: i386
Date: Sat Apr 30 16:33:46 2011
ErrorMessage: ErrorMessage: subprocess installed post-installation script returned error exit status 1
InstallationMedia: Ubuntu 10.04 LTS "Lucid Lynx" - Release i386 (20100429)
SourcePackage: memtest86+
Title: package memtest86+ 4.10-1.1ubuntu1 failed to install/upgrade: ErrorMessage: subprocess installed post-installation script returned error exit status 1
UpgradeStatus: Upgraded to natty on 2011-04-30 (0 days ago)
To manage notifications about this bug go to:
https://bugs.launchpad.net/ubuntu/+source/grub2/+bug/773959/+subscriptions
More information about the foundations-bugs
mailing list