[Bug 766043] Re: libspe2 version 2.2.80-95-3.1ubuntu4 failed to build on amd64

Brian Murray brian at ubuntu.com
Wed Jul 6 19:41:33 UTC 2011


** Changed in: libspe2 (Ubuntu Oneiric)
    Milestone: oneiric-alpha-3 => None

** Changed in: libspe2 (Ubuntu Oneiric)
       Status: New => Confirmed

** Tags added: main

-- 
You received this bug notification because you are a member of Ubuntu
Foundations Bugs, which is subscribed to libspe2 in Ubuntu.
https://bugs.launchpad.net/bugs/766043

Title:
  libspe2 version 2.2.80-95-3.1ubuntu4 failed to build on amd64

Status in “libspe2” package in Ubuntu:
  Confirmed
Status in “libspe2” source package in Oneiric:
  Confirmed

Bug description:
  libspe2 version 2.2.80-95-3.1ubuntu4 failed to build on amd64
  Link to failed build: https://launchpad.net/ubuntu/+archive/test-rebuild-20110413/+buildjob/2459900

  Direct link to the build log: https://launchpad.net/ubuntu/+archive
  /test-rebuild-20110413/+buildjob/2459900/+files/buildlog_ubuntu-natty-
  amd64.libspe2_2.2.80-95-3.1ubuntu4_FAILEDTOBUILD.txt.gz

  This log snippet might be of interest, since it triggered the matcher 'Purging chroot-autobuild'.
  Excerpt 6559 lines into the build log:

  Transcript written on refman.log.
  latex_count=5 ; \
  	while egrep -s 'Rerun (LaTeX|to get cross-references right)' refman.log && [ $latex_count -gt 0 ] ;\
  	    do \
  	      echo "Rerunning latex...." ;\
  	      pdflatex refman.tex ;\
  	      latex_count=`expr $latex_count - 1` ;\
  	    done
  make[2]: Leaving directory `/build/buildd/libspe2-2.2.80-95/latex'
  make[1]: Leaving directory `/build/buildd/libspe2-2.2.80-95'
  touch build-doc-stamp
   dpkg-genchanges -B -mUbuntu Build Daemon <buildd at pluot.ppa> >../libspe2_2.2.80-95-3.1ubuntu4_amd64.changes
  dpkg-genchanges: arch-specific upload - not including arch-independent packages
  dpkg-genchanges: error: cannot read files list file: No such file or directory
  dpkg-buildpackage: error: dpkg-genchanges gave error exit status 2
  ******************************************************************************
  Build finished at 20110418-2007
  FAILED [dpkg-buildpackage died]
  Purging chroot-autobuild/build/buildd/libspe2-2.2.80-95

To manage notifications about this bug go to:
https://bugs.launchpad.net/ubuntu/+source/libspe2/+bug/766043/+subscriptions




More information about the foundations-bugs mailing list