[Bug 765975] Re: aptitude version 0.6.3-3.2ubuntu1 failed to build on i386

Brian Murray brian at ubuntu.com
Wed Jul 6 19:40:04 UTC 2011


** Changed in: aptitude (Ubuntu Oneiric)
    Milestone: oneiric-alpha-3 => None

** Changed in: aptitude (Ubuntu Oneiric)
       Status: New => Confirmed

** Tags added: main

-- 
You received this bug notification because you are a member of Ubuntu
Foundations Bugs, which is subscribed to aptitude in Ubuntu.
https://bugs.launchpad.net/bugs/765975

Title:
  aptitude version 0.6.3-3.2ubuntu1 failed to build on i386

Status in “aptitude” package in Ubuntu:
  Confirmed
Status in “aptitude” source package in Oneiric:
  Confirmed

Bug description:
  aptitude version 0.6.3-3.2ubuntu1 failed to build on i386
  Link to failed build: https://launchpad.net/ubuntu/+archive/test-rebuild-20110413/+buildjob/2445621

  Direct link to the build log: https://launchpad.net/ubuntu/+archive
  /test-rebuild-20110413/+buildjob/2445621/+files/buildlog_ubuntu-
  natty-i386.aptitude_0.6.3-3.2ubuntu1_FAILEDTOBUILD.txt.gz

  This log snippet might be of interest, since it triggered the matcher 'Purging chroot-autobuild'.
  Excerpt 3286 lines into the build log:

  make[3]: Leaving directory `/build/buildd/aptitude-0.6.3/build-curses/src/generic/util'
  make[2]: *** [all-recursive] Error 1
  make[2]: Leaving directory `/build/buildd/aptitude-0.6.3/build-curses/src/generic'
  make[1]: *** [all-recursive] Error 1
  make[1]: Leaving directory `/build/buildd/aptitude-0.6.3/build-curses/src'
  make: *** [build-stamp-curses] Error 2
  make: *** Waiting for unfinished jobs....
  make[3]: *** [util.o] Error 1
  make[3]: Leaving directory `/build/buildd/aptitude-0.6.3/build-gtk/src/generic/util'
  make[2]: *** [all-recursive] Error 1
  make[2]: Leaving directory `/build/buildd/aptitude-0.6.3/build-gtk/src/generic'
  make[1]: *** [all-recursive] Error 1
  make[1]: Leaving directory `/build/buildd/aptitude-0.6.3/build-gtk/src'
  make: *** [build-stamp-gtk] Error 2
  dpkg-buildpackage: error: /usr/bin/fakeroot debian/rules binary gave error exit status 2
  ******************************************************************************
  Build finished at 20110414-1334
  FAILED [dpkg-buildpackage died]
  Purging chroot-autobuild/build/buildd/aptitude-0.6.3

To manage notifications about this bug go to:
https://bugs.launchpad.net/ubuntu/+source/aptitude/+bug/765975/+subscriptions




More information about the foundations-bugs mailing list