[Bug 862372] Re: package nvidia-173 173.14.22-0ubuntu11 failed to install/upgrade: nvidia-173 kernel module failed to build (nv.c:2321: internal compiler error: Segmentation fault)

oyster 862372 at bugs.launchpad.net
Tue Dec 6 23:32:20 UTC 2011


*** This bug is a duplicate of bug 683153 ***
    https://bugs.launchpad.net/bugs/683153

Should nvidia drivers be disabled when updating?  Is there a way to turn
off accelerated graphics otherwise?  I know how to disable twinview, so
i'll try that next time..  Also, one monitor was VGA and the other DVI -
are there successful installs with accelerated graphics and  twinview?

Thanks,
Chris Henley

On Fri, Dec 2, 2011 at 5:11 PM, Bryce Harrington
<862372 at bugs.launchpad.net>wrote:

> ** Description changed:
>
>  Twinview was active while attempting this update.  Full graphics were
>  enabled as well.
> +
> + /usr/src/linux-headers-2.6.32-34-generic/arch/x86/include/asm/compat.h:
> In function ‘arch_compat_alloc_user_space’:
> +
> /usr/src/linux-headers-2.6.32-34-generic/arch/x86/include/asm/compat.h:210:
> warning: pointer of type ‘void *’ used in arithmetic
> + /var/lib/dkms/nvidia-173/173.14.22/build/nv.c: In function
> ‘nv_kern_mmap’:
> + /var/lib/dkms/nvidia-173/173.14.22/build/nv.c:2321: internal compiler
> error: Segmentation fault
> + Please submit a full bug report,
> + with preprocessed source if appropriate.
> + See <file:///usr/share/doc/gcc-4.4/README.Bugs> for instructions.
> + make[3]: *** [/var/lib/dkms/nvidia-173/173.14.22/build/nv.o] Error 1
> + make[2]: *** [_module_/var/lib/dkms/nvidia-173/173.14.22/build] Error 2
> + NVIDIA: left KBUILD.
> + nvidia.ko failed to build!
> + make[1]: *** [module] Error 1
> + make: *** [module] Error 2
>
>  ProblemType: Package
>  DistroRelease: Ubuntu 10.04
>  Package: nvidia-173 173.14.22-0ubuntu11
>  ProcVersionSignature: Ubuntu 2.6.32-33.72-server 2.6.32.41+drm33.18
>  Uname: Linux 2.6.32-33-server x86_64
>  NonfreeKernelModules: nvidia
>  Architecture: amd64
>  Date: Thu Sep 29 08:53:26 2011
>  ErrorMessage: nvidia-173 kernel module failed to build
>  InstallationMedia: Ubuntu 10.04.1 LTS "Lucid Lynx" - Release amd64
> (20100816.1)
>  MachineType: BIOSTAR Group TA790GX 128M
>  PackageVersion: 173.14.22-0ubuntu11
>  ProcCmdLine: BOOT_IMAGE=/boot/vmlinuz-2.6.32-33-server
> root=UUID=1a873cf3-3a57-4b5a-8c04-417aceba0869 ro quiet splash
>  SourcePackage: nvidia-graphics-drivers-173
>   Title: package nvidia-173 173.14.22-0ubuntu11 failed to install/upgrade:
> nvidia-173 kernel module failed to build
>   dmi.bios.date: 08/04/2009
>  dmi.bios.vendor: American Megatrends Inc.
>  dmi.bios.version: 080014
>  dmi.board.asset.tag: To Be Filled By O.E.M.
>  dmi.board.name: TA790GX 128M
>  dmi.board.vendor: BIOSTAR Group
>  dmi.chassis.asset.tag: None
>  dmi.chassis.type: 3
>  dmi.chassis.vendor: BIOSTAR Group
>  dmi.chassis.version: 6.0
>  dmi.modalias:
> dmi:bvnAmericanMegatrendsInc.:bvr080014:bd08/04/2009:svnBIOSTARGroup:pnTA790GX128M:pvr:rvnBIOSTARGroup:rnTA790GX128M:rvr:cvnBIOSTARGroup:ct3:cvr6.0:
>  dmi.product.name: TA790GX 128M
>  dmi.sys.vendor: BIOSTAR Group
>  system:
> -  distro:             Ubuntu
> -  codename:           lucid
> -  architecture:       x86_64
> -  kernel:             2.6.32-33-server
> +  distro:             Ubuntu
> +  codename:           lucid
> +  architecture:       x86_64
> +  kernel:             2.6.32-33-server
>
> ** Summary changed:
>
> - package nvidia-173 173.14.22-0ubuntu11 failed to install/upgrade:
> nvidia-173 kernel module failed to build (nv.c:2321: internal compiler
> error: Segmentation fault)
> + nvidia-173 kernel module failed to build (nv.c:2321: internal compiler
> error: Segmentation fault) [Lucid]
>
> ** Changed in: nvidia-graphics-drivers-173 (Ubuntu)
>       Status: New => Triaged
>
> ** Changed in: nvidia-graphics-drivers-173 (Ubuntu)
>   Importance: Undecided => Medium
>
> --
> You received this bug notification because you are subscribed to the bug
> report.
> https://bugs.launchpad.net/bugs/862372
>
> Title:
>   nvidia-173 kernel module failed to build (nv.c:2321: internal compiler
>   error: Segmentation fault) [Lucid]
>
> To manage notifications about this bug go to:
>
> https://bugs.launchpad.net/ubuntu/+source/gcc-defaults/+bug/862372/+subscriptions
>


-- 
Chris Henley

-- 
You received this bug notification because you are a member of Ubuntu
Foundations Bugs, which is subscribed to gcc-defaults in Ubuntu.
https://bugs.launchpad.net/bugs/862372

Title:
  nvidia-173 kernel module failed to build (nv.c:2321: internal compiler
  error: Segmentation fault) [Lucid]

Status in “gcc-defaults” package in Ubuntu:
  New
Status in “nvidia-graphics-drivers-173” package in Ubuntu:
  Triaged

Bug description:
  Twinview was active while attempting this update.  Full graphics were
  enabled as well.

  /usr/src/linux-headers-2.6.32-34-generic/arch/x86/include/asm/compat.h: In function ‘arch_compat_alloc_user_space’:
  /usr/src/linux-headers-2.6.32-34-generic/arch/x86/include/asm/compat.h:210: warning: pointer of type ‘void *’ used in arithmetic
  /var/lib/dkms/nvidia-173/173.14.22/build/nv.c: In function ‘nv_kern_mmap’:
  /var/lib/dkms/nvidia-173/173.14.22/build/nv.c:2321: internal compiler error: Segmentation fault
  Please submit a full bug report,
  with preprocessed source if appropriate.
  See <file:///usr/share/doc/gcc-4.4/README.Bugs> for instructions.
  make[3]: *** [/var/lib/dkms/nvidia-173/173.14.22/build/nv.o] Error 1
  make[2]: *** [_module_/var/lib/dkms/nvidia-173/173.14.22/build] Error 2
  NVIDIA: left KBUILD.
  nvidia.ko failed to build!
  make[1]: *** [module] Error 1
  make: *** [module] Error 2

  ProblemType: Package
  DistroRelease: Ubuntu 10.04
  Package: nvidia-173 173.14.22-0ubuntu11
  ProcVersionSignature: Ubuntu 2.6.32-33.72-server 2.6.32.41+drm33.18
  Uname: Linux 2.6.32-33-server x86_64
  NonfreeKernelModules: nvidia
  Architecture: amd64
  Date: Thu Sep 29 08:53:26 2011
  ErrorMessage: nvidia-173 kernel module failed to build
  InstallationMedia: Ubuntu 10.04.1 LTS "Lucid Lynx" - Release amd64 (20100816.1)
  MachineType: BIOSTAR Group TA790GX 128M
  PackageVersion: 173.14.22-0ubuntu11
  ProcCmdLine: BOOT_IMAGE=/boot/vmlinuz-2.6.32-33-server root=UUID=1a873cf3-3a57-4b5a-8c04-417aceba0869 ro quiet splash
  SourcePackage: nvidia-graphics-drivers-173
  Title: package nvidia-173 173.14.22-0ubuntu11 failed to install/upgrade: nvidia-173 kernel module failed to build
  dmi.bios.date: 08/04/2009
  dmi.bios.vendor: American Megatrends Inc.
  dmi.bios.version: 080014
  dmi.board.asset.tag: To Be Filled By O.E.M.
  dmi.board.name: TA790GX 128M
  dmi.board.vendor: BIOSTAR Group
  dmi.chassis.asset.tag: None
  dmi.chassis.type: 3
  dmi.chassis.vendor: BIOSTAR Group
  dmi.chassis.version: 6.0
  dmi.modalias: dmi:bvnAmericanMegatrendsInc.:bvr080014:bd08/04/2009:svnBIOSTARGroup:pnTA790GX128M:pvr:rvnBIOSTARGroup:rnTA790GX128M:rvr:cvnBIOSTARGroup:ct3:cvr6.0:
  dmi.product.name: TA790GX 128M
  dmi.sys.vendor: BIOSTAR Group
  system:
   distro:             Ubuntu
   codename:           lucid
   architecture:       x86_64
   kernel:             2.6.32-33-server

To manage notifications about this bug go to:
https://bugs.launchpad.net/ubuntu/+source/gcc-defaults/+bug/862372/+subscriptions




More information about the foundations-bugs mailing list