[Bug 831351] Re: bzr-builddeb version 2.7.7 failed to build in oneiric

Bug Watch Updater 831351 at bugs.launchpad.net
Wed Aug 31 13:27:33 UTC 2011


** Changed in: bzr (Debian)
       Status: Confirmed => Fix Released

-- 
You received this bug notification because you are a member of Ubuntu
Foundations Bugs, which is subscribed to bzr in Ubuntu.
https://bugs.launchpad.net/bugs/831351

Title:
  bzr-builddeb version 2.7.7 failed to build in oneiric

Status in “bzr” package in Ubuntu:
  In Progress
Status in “bzr” source package in Oneiric:
  In Progress
Status in “bzr” package in Debian:
  Fix Released

Bug description:
  bzr-builddeb version 2.7.7 failed to build in oneiric
  Link to failed build: https://launchpad.net/ubuntu/+archive/test-rebuild-20110816/+build/2689746

  Details about the rebuild:
  http://people.ubuntuwire.org/~wgrant/rebuild-ftbfs-test/test-rebuild-20110816-oneiric.html

  Direct link to the build log: https://launchpad.net/ubuntu/+archive
  /test-rebuild-20110816/+build/2689746/+files/buildlog_ubuntu-
  oneiric-i386.bzr-builddeb_2.7.7_FAILEDTOBUILD.txt.gz

  This log snippet might be of interest, since it triggered the matcher 'Purging chroot-autobuild'.
  Excerpt 1304 lines into the build log:

      _repack_other(target_transport, new_name, source_name)
    File "/build/buildd/bzr-builddeb-2.7.7/repack_tarball.py", line 209, in _repack_other
      target_f = target_transport.open_write_stream(new_name)
    File "/usr/lib/python2.7/dist-packages/bzrlib/transport/local.py", line 331, in open_write_stream
      handle = osutils.open_file(abspath, 'wb')
  IOError: [Errno 20] Not a directory: u'/tmp/testbzr-Jyt_h5.tmp/bzrlib.plugins.builddeb.tests.test_repack_tarball.TestRepackTarball.test_repack_tarball_with_target_dir_not_dir(.tar)/work/tarballs/package_0.2.orig.tar.gz'
  ------------

  ----------------------------------------------------------------------
  Ran 472 tests in 96.228s

  FAILED (errors=7)
  3 tests skipped
  make: *** [build-python2.7] Error 1
  dpkg-buildpackage: error: debian/rules build gave error exit status 2
  ******************************************************************************
  Build finished at 20110820-1803
  FAILED [dpkg-buildpackage died]
  Purging chroot-autobuild/build/buildd/bzr-builddeb-2.7.7

To manage notifications about this bug go to:
https://bugs.launchpad.net/ubuntu/+source/bzr/+bug/831351/+subscriptions




More information about the foundations-bugs mailing list