[Bug 837525] Re: package libpam-modules 1.1.2-2ubuntu8.3 failed to install/upgrade: error writing to '<standard output>': No such file or directory
hir8r
837525 at bugs.launchpad.net
Tue Aug 30 16:35:08 UTC 2011
--
You received this bug notification because you are a member of Ubuntu
Foundations Bugs, which is subscribed to pam in Ubuntu.
https://bugs.launchpad.net/bugs/837525
Title:
package libpam-modules 1.1.2-2ubuntu8.3 failed to install/upgrade:
error writing to '<standard output>': No such file or directory
Status in “pam” package in Ubuntu:
New
Bug description:
error after logging in. no other comments.
ProblemType: Package
DistroRelease: Ubuntu 11.04
Package: libpam-modules 1.1.2-2ubuntu8.3
ProcVersionSignature: Ubuntu 2.6.38-8.42-generic 2.6.38.2
Uname: Linux 2.6.38-8-generic x86_64
NonfreeKernelModules: nvidia
Architecture: amd64
Date: Tue Aug 30 12:20:14 2011
DpkgTerminalLog:
Preparing to replace libpam-modules 1.1.2-2ubuntu8 (using .../libpam-modules_1.1.2-2ubuntu8.3_amd64.deb) ...
Unpacking replacement libpam-modules ...
Processing triggers for man-db ...
ErrorMessage: error writing to '<standard output>': No such file or directory
InstallationMedia: Ubuntu 11.04 "Natty Narwhal" - Release amd64 (20110427.1)
SourcePackage: pam
Title: package libpam-modules 1.1.2-2ubuntu8.3 failed to install/upgrade: error writing to '<standard output>': No such file or directory
UpgradeStatus: No upgrade log present (probably fresh install)
To manage notifications about this bug go to:
https://bugs.launchpad.net/ubuntu/+source/pam/+bug/837525/+subscriptions
More information about the foundations-bugs
mailing list