[Bug 823711] Re: libvirt version 0.9.2-4ubuntu8 failed to build on armel
Launchpad Bug Tracker
823711 at bugs.launchpad.net
Tue Aug 23 08:25:11 UTC 2011
This bug was fixed in the package gcc-4.6 - 4.6.1-7ubuntu2
---------------
gcc-4.6 (4.6.1-7ubuntu2) oneiric; urgency=low
* Update to SVN 20110823 (r177982) from the gcc-4_6-branch.
Fix PR fortran/49792, PR tree-optimization/48739, PR target/50092,
PR c++/50086, PR c++/50054, PR fortran/50050, PR fortran/50130,
PR fortran/50129, PR fortran/49792, PR fortran/50109.
* Properly disable multilib builds for selected libraries on armel and armhf.
* Update and re-enable the gcc-ice patch.
* Update and re-enable the gcc-cloog-dl patch.
* Fix [ARM] PR target/50090: aliases in libgcc.a with default visibility,
taken from the trunk. LP: #823711.
* Re-work the multiarch patches.
* Break older gcj-4.6 and gnat-4.6 versions, changed gcc_lib_dir.
* Omit the target alias from the go libdir.
* Linaro updates from the 4.6-2011.07-stable branch.
-- Matthias Klose <doko at ubuntu.com> Tue, 23 Aug 2011 09:26:22 +0200
** Changed in: gcc-4.6 (Ubuntu Oneiric)
Status: Triaged => Fix Released
--
You received this bug notification because you are a member of Ubuntu
Foundations Bugs, which is subscribed to gcc-4.5 in Ubuntu.
https://bugs.launchpad.net/bugs/823711
Title:
libvirt version 0.9.2-4ubuntu8 failed to build on armel
Status in Linaro Binutils:
Invalid
Status in Linaro GCC:
Confirmed
Status in “gcc-4.5” package in Ubuntu:
Fix Released
Status in “gcc-4.6” package in Ubuntu:
Fix Released
Status in “libvirt” package in Ubuntu:
Fix Released
Status in “gcc-4.5” source package in Oneiric:
Fix Released
Status in “gcc-4.6” source package in Oneiric:
Fix Released
Status in “libvirt” source package in Oneiric:
Fix Released
Bug description:
libvirt version 0.9.2-4ubuntu8 failed to build on armel
Link to failed build: https://launchpad.net/ubuntu/+source/libvirt/0.9.2-4ubuntu8/+build/2673838
Direct link to the build log:
https://launchpad.net/ubuntu/+source/libvirt/0.9.2-4ubuntu8/+build/2673838/+files
/buildlog_ubuntu-oneiric-
armel.libvirt_0.9.2-4ubuntu8_FAILEDTOBUILD.txt.gz
This log snippet might be of interest, since it triggered the matcher 'Purging chroot-autobuild'.
Excerpt 5798 lines into the build log:
................. 57 OK
PASS: cputest
=======================================
10 of 48 tests failed
(1 test was not run)
Please report to libvir-list at redhat.com
=======================================
make[3]: *** [check-TESTS] Error 1
make[3]: Leaving directory `/build/buildd/libvirt-0.9.2/tests'
make[2]: *** [check-am] Error 2
make[2]: Leaving directory `/build/buildd/libvirt-0.9.2/tests'
make[1]: *** [check-recursive] Error 1
make[1]: Leaving directory `/build/buildd/libvirt-0.9.2'
make: *** [debian/stamp-makefile-check] Error 2
dpkg-buildpackage: error: debian/rules build gave error exit status 2
******************************************************************************
Build finished at 20110809-1359
FAILED [dpkg-buildpackage died]
Purging chroot-autobuild/build/buildd/libvirt-0.9.2
To manage notifications about this bug go to:
https://bugs.launchpad.net/binutils-linaro/+bug/823711/+subscriptions
More information about the foundations-bugs
mailing list