[Bug 830023] Re: package libgudev-1.0-0 1:173-0ubuntu2 failed to install/upgrade: error writing to '<standard output>': Success
Brian Murray
brian at ubuntu.com
Mon Aug 22 17:48:06 UTC 2011
*** This bug is a duplicate of bug 545790 ***
https://bugs.launchpad.net/bugs/545790
Thank you for taking the time to report this bug and helping to make
Ubuntu better. This particular bug has already been reported and is a
duplicate of bug 545790, so it is being marked as such. Please look at
the other bug report to see if there is any missing information that you
can provide, or to see if there is a workaround for the bug.
Additionally, any further discussion regarding the bug should occur in
the other report. Please continue to report any other bugs you may
find.
** This bug has been marked a duplicate of bug 545790
package PACKAGE failed to install/upgrade: error writing to '<standard output>': Success
--
You received this bug notification because you are a member of Ubuntu
Foundations Bugs, which is subscribed to udev in Ubuntu.
https://bugs.launchpad.net/bugs/830023
Title:
package libgudev-1.0-0 1:173-0ubuntu2 failed to install/upgrade: error
writing to '<standard output>': Success
Status in “udev” package in Ubuntu:
New
Bug description:
Appeared after login
ProblemType: Package
DistroRelease: Ubuntu 11.10
Package: libgudev-1.0-0 1:173-0ubuntu2
ProcVersionSignature: Ubuntu 3.0.0-8.11-generic-pae 3.0.1
Uname: Linux 3.0.0-8-generic-pae i686
Architecture: i386
Date: Fri Aug 19 08:24:38 2011
ErrorMessage: error writing to '<standard output>': Success
SourcePackage: udev
Title: package libgudev-1.0-0 1:173-0ubuntu2 failed to install/upgrade: error writing to '<standard output>': Success
UpgradeStatus: Upgraded to oneiric on 2011-07-25 (26 days ago)
To manage notifications about this bug go to:
https://bugs.launchpad.net/ubuntu/+source/udev/+bug/830023/+subscriptions
More information about the foundations-bugs
mailing list