[Bug 829428] Re: btrfs-tools version 0.19+20100601-3ubuntu2 failed to build in oneiric

Colin Watson cjwatson at canonical.com
Mon Aug 22 12:11:26 UTC 2011


I've sent a patch upstream for this.  I'd like to have it confirmed
there - filesystems are delicate beasts.

** Changed in: btrfs-tools (Ubuntu Oneiric)
     Assignee: (unassigned) => Colin Watson (cjwatson)

-- 
You received this bug notification because you are a member of Ubuntu
Foundations Bugs, which is subscribed to btrfs-tools in Ubuntu.
https://bugs.launchpad.net/bugs/829428

Title:
  btrfs-tools version 0.19+20100601-3ubuntu2 failed to build in oneiric

Status in “btrfs-tools” package in Ubuntu:
  Confirmed
Status in “btrfs-tools” source package in Oneiric:
  Confirmed

Bug description:
  btrfs-tools version 0.19+20100601-3ubuntu2 failed to build in oneiric
  Link to failed build: https://launchpad.net/ubuntu/+archive/test-rebuild-20110816/+build/2689658

  Details about the rebuild:
  http://people.ubuntuwire.org/~wgrant/rebuild-ftbfs-test/test-rebuild-20110816-oneiric.html

  Direct link to the build log: https://launchpad.net/ubuntu/+archive
  /test-rebuild-20110816/+build/2689658/+files/buildlog_ubuntu-
  oneiric-i386.btrfs-tools_0.19%2B20100601-3ubuntu2_FAILEDTOBUILD.txt.gz

  This log snippet might be of interest, since it triggered the matcher 'Purging chroot-autobuild'.
  Excerpt 585 lines into the build log:

  ctree.c:999:6: error: variable 'orig_ptr' set but not used [-Werror=unused-but-set-variable]
  ctree.c: In function 'btrfs_truncate_item':
  ctree.c:2373:6: error: variable 'slot_orig' set but not used [-Werror=unused-but-set-variable]
  ctree.c: In function 'btrfs_extend_item':
  ctree.c:2471:6: error: variable 'slot_orig' set but not used [-Werror=unused-but-set-variable]
  ctree.c: In function 'btrfs_insert_empty_items':
  ctree.c:2544:6: error: variable 'slot_orig' set but not used [-Werror=unused-but-set-variable]
  cc1: all warnings being treated as errors

  make[2]: *** [ctree.o] Error 1
  make[2]: Leaving directory `/build/buildd/btrfs-tools-0.19+20100601'
  make[1]: *** [override_dh_auto_build] Error 2
  make[1]: Leaving directory `/build/buildd/btrfs-tools-0.19+20100601'
  make: *** [build] Error 2
  dpkg-buildpackage: error: debian/rules build gave error exit status 2
  ******************************************************************************
  Build finished at 20110817-0020
  FAILED [dpkg-buildpackage died]
  Purging chroot-autobuild/build/buildd/btrfs-tools-0.19+20100601

To manage notifications about this bug go to:
https://bugs.launchpad.net/ubuntu/+source/btrfs-tools/+bug/829428/+subscriptions




More information about the foundations-bugs mailing list