[Bug 829954] Re: package libgudev-1.0-0 1:173-0ubuntu2 failed to install/upgrade: error writing to '<standard output>': Success

Andi Chandler 829954 at bugs.launchpad.net
Sat Aug 20 08:56:48 UTC 2011


-- 
You received this bug notification because you are a member of Ubuntu
Foundations Bugs, which is subscribed to udev in Ubuntu.
https://bugs.launchpad.net/bugs/829954

Title:
  package libgudev-1.0-0 1:173-0ubuntu2 failed to install/upgrade: error
  writing to '<standard output>': Success

Status in “udev” package in Ubuntu:
  New

Bug description:
  Appeared after logging in.

  ProblemType: Package
  DistroRelease: Ubuntu 11.10
  Package: libgudev-1.0-0 1:173-0ubuntu2
  ProcVersionSignature: Ubuntu 3.0.0-8.11-generic-pae 3.0.1
  Uname: Linux 3.0.0-8-generic-pae i686
  Architecture: i386
  Date: Fri Aug 19 08:24:38 2011
  ErrorMessage: error writing to '<standard output>': Success
  SourcePackage: udev
  Title: package libgudev-1.0-0 1:173-0ubuntu2 failed to install/upgrade: error writing to '<standard output>': Success
  UpgradeStatus: Upgraded to oneiric on 2011-07-25 (26 days ago)

To manage notifications about this bug go to:
https://bugs.launchpad.net/ubuntu/+source/udev/+bug/829954/+subscriptions




More information about the foundations-bugs mailing list