[Bug 829463] Re: mdadm version 3.1.4-1+8efb9d1ubuntu5 failed to build in oneiric
Stefan Lesicnik
stefan at lsd.co.za
Fri Aug 19 16:25:04 UTC 2011
Patch located here
http://neil.brown.name/git?p=mdadm;a=commitdiff;h=7e90264df5060cd308ce56206ec7dfa29e2aa041
Will investigate this
--
You received this bug notification because you are a member of Ubuntu
Foundations Bugs, which is subscribed to mdadm in Ubuntu.
https://bugs.launchpad.net/bugs/829463
Title:
mdadm version 3.1.4-1+8efb9d1ubuntu5 failed to build in oneiric
Status in “mdadm” package in Ubuntu:
Confirmed
Status in “mdadm” source package in Oneiric:
Confirmed
Bug description:
mdadm version 3.1.4-1+8efb9d1ubuntu5 failed to build in oneiric
Link to failed build: https://launchpad.net/ubuntu/+archive/test-rebuild-20110816/+build/2704931
Details about the rebuild:
http://people.ubuntuwire.org/~wgrant/rebuild-ftbfs-test/test-rebuild-20110816-oneiric.html
Direct link to the build log: https://launchpad.net/ubuntu/+archive
/test-rebuild-20110816/+build/2704931/+files/buildlog_ubuntu-
oneiric-i386.mdadm_3.1.4-1%2B8efb9d1ubuntu5_FAILEDTOBUILD.txt.gz
This log snippet might be of interest, since it triggered the matcher 'Purging chroot-autobuild'.
Excerpt 513 lines into the build log:
make[1]: Entering directory `/build/buildd/mdadm-3.1.4'
dh_testdir
/usr/bin/make CXFLAGS="-ggdb -Wno-strict-aliasing -fomit-frame-pointer -Os" CONFFILE=/tmp/mdadm.conf all
make[2]: Entering directory `/build/buildd/mdadm-3.1.4'
gcc -Wall -Werror -Wstrict-prototypes -Wextra -Wno-unused-parameter -ggdb -Wno-strict-aliasing -fomit-frame-pointer -Os -DSendmail=\""/usr/sbin/sendmail -t"\" -DCONFFILE=\"/tmp/mdadm.conf\" -DCONFFILE2=\"/etc/mdadm.conf\" -DMAP_DIR=\"/dev/.mdadm\" -DMAP_FILE=\"map\" -DMDMON_DIR=\"/dev/.mdadm\" -DUSE_PTHREADS -DDEBIAN -c -o mdadm.o mdadm.c
mdadm.c: In function 'main':
mdadm.c:105:6: error: variable 'auto_update_home' set but not used [-Werror=unused-but-set-variable]
cc1: all warnings being treated as errors
make[2]: *** [mdadm.o] Error 1
make[2]: Leaving directory `/build/buildd/mdadm-3.1.4'
make[1]: *** [mdadm.udeb] Error 2
make[1]: Leaving directory `/build/buildd/mdadm-3.1.4'
make: *** [build-stamp] Error 2
dpkg-buildpackage: error: debian/rules build gave error exit status 2
******************************************************************************
Build finished at 20110818-0223
FAILED [dpkg-buildpackage died]
Purging chroot-autobuild/build/buildd/mdadm-3.1.4
To manage notifications about this bug go to:
https://bugs.launchpad.net/ubuntu/+source/mdadm/+bug/829463/+subscriptions
More information about the foundations-bugs
mailing list