[Bug 829389] [NEW] rootskel version 1.96ubuntu1 failed to build in oneiric
Matthias Klose
doko at ubuntu.com
Fri Aug 19 12:44:23 UTC 2011
Public bug reported:
rootskel version 1.96ubuntu1 failed to build in oneiric
Link to failed build: https://launchpad.net/ubuntu/+archive/test-rebuild-20110816/+build/2710588
Details about the rebuild:
http://people.ubuntuwire.org/~wgrant/rebuild-ftbfs-test/test-rebuild-20110816-oneiric.html
Direct link to the build log: https://launchpad.net/ubuntu/+archive
/test-rebuild-20110816/+build/2710588/+files/buildlog_ubuntu-
oneiric-i386.rootskel_1.96ubuntu1_FAILEDTOBUILD.txt.gz
This log snippet might be of interest, since it triggered the matcher 'Purging chroot-autobuild'.
Excerpt 258 lines into the build log:
make[2]: Entering directory `/build/buildd/rootskel-1.96ubuntu1/src-bootfloppy'
klcc -Os -Wall -shared init.c -o init
In file included from /usr/lib/klibc/include/sys/types.h:15:0,
from /usr/lib/klibc/include/unistd.h:11,
from /usr/lib/klibc/include/stdio.h:11,
from init.c:14:
/usr/lib/klibc/include/linux/posix_types.h:47:29: fatal error: asm/posix_types.h: No such file or directory
compilation terminated.
make[2]: *** [init] Error 1
make[2]: Leaving directory `/build/buildd/rootskel-1.96ubuntu1/src-bootfloppy'
make[1]: *** [build-recursive] Error 1
make[1]: Leaving directory `/build/buildd/rootskel-1.96ubuntu1'
dh_auto_build: make -j1 returned exit code 2
make: *** [build] Error 2
dpkg-buildpackage: error: debian/rules build gave error exit status 2
******************************************************************************
Build finished at 20110818-1354
FAILED [dpkg-buildpackage died]
Purging chroot-autobuild/build/buildd/rootskel-1.96ubuntu1
** Affects: rootskel (Ubuntu)
Importance: Undecided
Status: Invalid
** Tags: ftbfs oneiric
** Changed in: rootskel (Ubuntu)
Status: New => Invalid
--
You received this bug notification because you are a member of Ubuntu
Foundations Bugs, which is subscribed to rootskel in Ubuntu.
https://bugs.launchpad.net/bugs/829389
Title:
rootskel version 1.96ubuntu1 failed to build in oneiric
Status in “rootskel” package in Ubuntu:
Invalid
Bug description:
rootskel version 1.96ubuntu1 failed to build in oneiric
Link to failed build: https://launchpad.net/ubuntu/+archive/test-rebuild-20110816/+build/2710588
Details about the rebuild:
http://people.ubuntuwire.org/~wgrant/rebuild-ftbfs-test/test-rebuild-20110816-oneiric.html
Direct link to the build log: https://launchpad.net/ubuntu/+archive
/test-rebuild-20110816/+build/2710588/+files/buildlog_ubuntu-
oneiric-i386.rootskel_1.96ubuntu1_FAILEDTOBUILD.txt.gz
This log snippet might be of interest, since it triggered the matcher 'Purging chroot-autobuild'.
Excerpt 258 lines into the build log:
make[2]: Entering directory `/build/buildd/rootskel-1.96ubuntu1/src-bootfloppy'
klcc -Os -Wall -shared init.c -o init
In file included from /usr/lib/klibc/include/sys/types.h:15:0,
from /usr/lib/klibc/include/unistd.h:11,
from /usr/lib/klibc/include/stdio.h:11,
from init.c:14:
/usr/lib/klibc/include/linux/posix_types.h:47:29: fatal error: asm/posix_types.h: No such file or directory
compilation terminated.
make[2]: *** [init] Error 1
make[2]: Leaving directory `/build/buildd/rootskel-1.96ubuntu1/src-bootfloppy'
make[1]: *** [build-recursive] Error 1
make[1]: Leaving directory `/build/buildd/rootskel-1.96ubuntu1'
dh_auto_build: make -j1 returned exit code 2
make: *** [build] Error 2
dpkg-buildpackage: error: debian/rules build gave error exit status 2
******************************************************************************
Build finished at 20110818-1354
FAILED [dpkg-buildpackage died]
Purging chroot-autobuild/build/buildd/rootskel-1.96ubuntu1
To manage notifications about this bug go to:
https://bugs.launchpad.net/ubuntu/+source/rootskel/+bug/829389/+subscriptions
More information about the foundations-bugs
mailing list